{"text_format":"1","workbook":"xlsx","n_sheets":7,"sheets":["Menu","Socios","Impostos","Historico","Dash","Instruções","calc"],"not_rendered":{"charts":3,"images":8,"macros":1,"external_links":0,"defined_names":8,"comments":0,"pivot_tables":0},"unopened":[],"bounds":{"document_bytes":16777216,"sheet_cells":100000,"rows_first":2000,"rows_last":500,"rows_between":2000,"halvings":0,"cell_chars":16384,"cell_head_chars":4096},"cells_cut":0,"cells_raw":0,"read":"whole","date_system":"1900"}

{"sheet":"Menu","index":0,"n_rows":26,"n_cols":7,"rows_kept":26,"cut":false,"hidden":false,"merged":[[25,4,25,5],[25,6,25,14]]}
[]
[]
[]
[]
[]
[]
[]
[]
[]
[]
[]
[]
[]
[]
[]
[]
[]
[]
[]
[]
[]
[]
[]
[]
[]
[null,null,null,null,"Empresa:",null,"Empresa ABCDE"]

{"sheet":"Socios","index":1,"n_rows":19,"n_cols":4,"rows_kept":19,"cut":false,"hidden":false,"merged":[[9,2,9,5],[12,1,13,1],[12,2,13,2],[12,3,13,3]]}
[]
[]
[]
[]
[]
[]
[]
[]
[]
[null,"Empresa:","Empresa ABCDE"]
[]
[null,"CADASTRO DOS SÓCIOS\nInsira os proprietários da empresa."]
[null,"NOME","PORCENTAGEM","PREVISÃO DE PRÓ-LABORE MENSAL"]
[]
[null,"João Paulo",0.2,4000]
[null,"Pedro Alves",0.2,4000]
[null,"Sócio 3",0.2,4000]
[null,"Sócio 4",0.2,4000]
[null,"Sócio 5",0.2,4000]

{"sheet":"Impostos","index":2,"n_rows":16,"n_cols":3,"rows_kept":16,"cut":false,"hidden":false,"merged":[[9,2,9,5],[12,1,13,1],[12,2,13,2]]}
[]
[]
[]
[]
[]
[]
[]
[]
[]
[null,"Empresa:","Empresa ABCDE"]
[]
[null,"CADASTRO DOS IMPOSTOS\nInsira os impostos referentes às retiradas dos sócios."]
[null,"IMPOSTO","PORCENTAGEM"]
[]
[null,"Imposto 1",0.05]
[null,"Imposto 2",0.02]

{"sheet":"Historico","index":3,"n_rows":1000,"n_cols":14,"rows_kept":1000,"cut":false,"hidden":false,"merged":[[9,2,9,5],[12,1,13,1],[12,2,13,2],[12,3,13,3],[12,4,13,4],[12,5,13,5],[12,6,13,6],[12,7,13,7],[12,8,13,8],[12,9,13,9],[12,10,13,10]]}
[]
[]
[]
[]
[]
[]
[]
[]
[]
[null,"Empresa:","Empresa ABCDE"]
[]
[null,"Histórico de Retiradas\nInsira as retiradas realizadas."]
[null,"SÓCIO","DATA DA  RETIRADA","VALOR",{"$f":"IF(Impostos!B15=\"\",\"\",Impostos!B15)","v":"Imposto 1"},{"$f":"IF(Impostos!B16=\"\",\"\",Impostos!B16)","v":"Imposto 2"},{"$f":"IF(Impostos!B17=\"\",\"\",Impostos!B17)","v":""},{"$f":"IF(Impostos!B18=\"\",\"\",Impostos!B18)","v":""},{"$f":"IF(Impostos!B19=\"\",\"\",Impostos!B19)","v":""},"TOTAL DE IMPOSTOS","VALOR LÍQUIDO"]
[null,null,null,null,null,null,null,null,null,null,null,null,null,"Mês"]
[null,"João Paulo","2020-05-01",3000,{"$f":"D15*Impostos!$C$15","v":150},{"$f":"D15*Impostos!$C$16","v":60},{"$f":"D15*Impostos!$C$17","v":0},{"$f":"D15*Impostos!$C$18","v":0},{"$f":"D15*Impostos!$C$19","v":0},{"$f":"SUM(E15:I15)","v":210},{"$f":"D15-J15","v":2790},null,null,{"$f":"IF(C15=\"\",\"\",MONTH(C15))","v":5}]
[null,"Pedro Alves","2020-06-01",2000,{"$f":"D16*Impostos!$C$15","v":100},{"$f":"D16*Impostos!$C$16","v":40},{"$f":"D16*Impostos!$C$17","v":0},{"$f":"D16*Impostos!$C$18","v":0},{"$f":"D16*Impostos!$C$19","v":0},{"$f":"SUM(E16:I16)","v":140},{"$f":"D16-J16","v":1860},null,null,{"$f":"IF(C16=\"\",\"\",MONTH(C16))","v":6}]
[null,"João Paulo","2020-07-01",1500,{"$f":"D17*Impostos!$C$15","v":75},{"$f":"D17*Impostos!$C$16","v":30},{"$f":"D17*Impostos!$C$17","v":0},{"$f":"D17*Impostos!$C$18","v":0},{"$f":"D17*Impostos!$C$19","v":0},105,1395,null,null,7]
[null,"João Paulo","2020-08-01",2000,{"$f":"D18*Impostos!$C$15","v":100},{"$f":"D18*Impostos!$C$16","v":40},{"$f":"D18*Impostos!$C$17","v":0},{"$f":"D18*Impostos!$C$18","v":0},{"$f":"D18*Impostos!$C$19","v":0},140,1860,null,null,8]
[null,"Sócio 3","2020-10-01",1000,{"$f":"D19*Impostos!$C$15","v":50},{"$f":"D19*Impostos!$C$16","v":20},{"$f":"D19*Impostos!$C$17","v":0},{"$f":"D19*Impostos!$C$18","v":0},{"$f":"D19*Impostos!$C$19","v":0},70,930,null,null,10]
[null,"Sócio 4","2020-10-02",1000,{"$f":"D20*Impostos!$C$15","v":50},{"$f":"D20*Impostos!$C$16","v":20},{"$f":"D20*Impostos!$C$17","v":0},{"$f":"D20*Impostos!$C$18","v":0},{"$f":"D20*Impostos!$C$19","v":0},{"$f":"SUM(E20:I20)","v":70},{"$f":"D20-J20","v":930},null,null,10]
[null,"Sócio 5","2020-10-03",1000,{"$f":"D21*Impostos!$C$15","v":50},{"$f":"D21*Impostos!$C$16","v":20},{"$f":"D21*Impostos!$C$17","v":0},{"$f":"D21*Impostos!$C$18","v":0},{"$f":"D21*Impostos!$C$19","v":0},70,930,null,null,10]
[null,null,null,null,{"$f":"D22*Impostos!$C$15","v":0},{"$f":"D22*Impostos!$C$16","v":0},{"$f":"D22*Impostos!$C$17","v":0},{"$f":"D22*Impostos!$C$18","v":0},{"$f":"D22*Impostos!$C$19","v":0},0,0,null,null,""]
[null,null,null,null,{"$f":"D23*Impostos!$C$15","v":0},{"$f":"D23*Impostos!$C$16","v":0},{"$f":"D23*Impostos!$C$17","v":0},{"$f":"D23*Impostos!$C$18","v":0},{"$f":"D23*Impostos!$C$19","v":0},0,0,null,null,""]
[null,null,null,null,{"$f":"D24*Impostos!$C$15","v":0},{"$f":"D24*Impostos!$C$16","v":0},{"$f":"D24*Impostos!$C$17","v":0},{"$f":"D24*Impostos!$C$18","v":0},{"$f":"D24*Impostos!$C$19","v":0},0,0,null,null,""]
[null,null,null,null,{"$f":"D25*Impostos!$C$15","v":0},{"$f":"D25*Impostos!$C$16","v":0},{"$f":"D25*Impostos!$C$17","v":0},{"$f":"D25*Impostos!$C$18","v":0},{"$f":"D25*Impostos!$C$19","v":0},0,0,null,null,""]
[null,null,null,null,{"$f":"D26*Impostos!$C$15","v":0},{"$f":"D26*Impostos!$C$16","v":0},{"$f":"D26*Impostos!$C$17","v":0},{"$f":"D26*Impostos!$C$18","v":0},{"$f":"D26*Impostos!$C$19","v":0},0,0,null,null,""]
[null,null,null,null,{"$f":"D27*Impostos!$C$15","v":0},{"$f":"D27*Impostos!$C$16","v":0},{"$f":"D27*Impostos!$C$17","v":0},{"$f":"D27*Impostos!$C$18","v":0},{"$f":"D27*Impostos!$C$19","v":0},0,0,null,null,""]
[null,null,null,null,{"$f":"D28*Impostos!$C$15","v":0},{"$f":"D28*Impostos!$C$16","v":0},{"$f":"D28*Impostos!$C$17","v":0},{"$f":"D28*Impostos!$C$18","v":0},{"$f":"D28*Impostos!$C$19","v":0},0,0,null,null,""]
[null,null,null,null,{"$f":"D29*Impostos!$C$15","v":0},{"$f":"D29*Impostos!$C$16","v":0},{"$f":"D29*Impostos!$C$17","v":0},{"$f":"D29*Impostos!$C$18","v":0},{"$f":"D29*Impostos!$C$19","v":0},0,0,null,null,""]
[null,null,null,null,{"$f":"D30*Impostos!$C$15","v":0},{"$f":"D30*Impostos!$C$16","v":0},{"$f":"D30*Impostos!$C$17","v":0},{"$f":"D30*Impostos!$C$18","v":0},{"$f":"D30*Impostos!$C$19","v":0},0,0,null,null,""]
[null,null,null,null,{"$f":"D31*Impostos!$C$15","v":0},{"$f":"D31*Impostos!$C$16","v":0},{"$f":"D31*Impostos!$C$17","v":0},{"$f":"D31*Impostos!$C$18","v":0},{"$f":"D31*Impostos!$C$19","v":0},0,0,null,null,""]
[null,null,null,null,{"$f":"D32*Impostos!$C$15","v":0},{"$f":"D32*Impostos!$C$16","v":0},{"$f":"D32*Impostos!$C$17","v":0},{"$f":"D32*Impostos!$C$18","v":0},{"$f":"D32*Impostos!$C$19","v":0},0,0,null,null,""]
[null,null,null,null,{"$f":"D33*Impostos!$C$15","v":0},{"$f":"D33*Impostos!$C$16","v":0},{"$f":"D33*Impostos!$C$17","v":0},{"$f":"D33*Impostos!$C$18","v":0},{"$f":"D33*Impostos!$C$19","v":0},0,0,null,null,""]
[null,null,null,null,{"$f":"D34*Impostos!$C$15","v":0},{"$f":"D34*Impostos!$C$16","v":0},{"$f":"D34*Impostos!$C$17","v":0},{"$f":"D34*Impostos!$C$18","v":0},{"$f":"D34*Impostos!$C$19","v":0},0,0,null,null,""]
[null,null,null,null,{"$f":"D35*Impostos!$C$15","v":0},{"$f":"D35*Impostos!$C$16","v":0},{"$f":"D35*Impostos!$C$17","v":0},{"$f":"D35*Impostos!$C$18","v":0},{"$f":"D35*Impostos!$C$19","v":0},0,0,null,null,""]
[null,null,null,null,{"$f":"D36*Impostos!$C$15","v":0},{"$f":"D36*Impostos!$C$16","v":0},{"$f":"D36*Impostos!$C$17","v":0},{"$f":"D36*Impostos!$C$18","v":0},{"$f":"D36*Impostos!$C$19","v":0},0,0,null,null,""]
[null,null,null,null,{"$f":"D37*Impostos!$C$15","v":0},{"$f":"D37*Impostos!$C$16","v":0},{"$f":"D37*Impostos!$C$17","v":0},{"$f":"D37*Impostos!$C$18","v":0},{"$f":"D37*Impostos!$C$19","v":0},0,0,null,null,""]
[null,null,null,null,{"$f":"D38*Impostos!$C$15","v":0},{"$f":"D38*Impostos!$C$16","v":0},{"$f":"D38*Impostos!$C$17","v":0},{"$f":"D38*Impostos!$C$18","v":0},{"$f":"D38*Impostos!$C$19","v":0},0,0,null,null,""]
[null,null,null,null,{"$f":"D39*Impostos!$C$15","v":0},{"$f":"D39*Impostos!$C$16","v":0},{"$f":"D39*Impostos!$C$17","v":0},{"$f":"D39*Impostos!$C$18","v":0},{"$f":"D39*Impostos!$C$19","v":0},0,0,null,null,""]
[null,null,null,null,{"$f":"D40*Impostos!$C$15","v":0},{"$f":"D40*Impostos!$C$16","v":0},{"$f":"D40*Impostos!$C$17","v":0},{"$f":"D40*Impostos!$C$18","v":0},{"$f":"D40*Impostos!$C$19","v":0},0,0,null,null,""]
[null,null,null,null,{"$f":"D41*Impostos!$C$15","v":0},{"$f":"D41*Impostos!$C$16","v":0},{"$f":"D41*Impostos!$C$17","v":0},{"$f":"D41*Impostos!$C$18","v":0},{"$f":"D41*Impostos!$C$19","v":0},0,0,null,null,""]
[null,null,null,null,{"$f":"D42*Impostos!$C$15","v":0},{"$f":"D42*Impostos!$C$16","v":0},{"$f":"D42*Impostos!$C$17","v":0},{"$f":"D42*Impostos!$C$18","v":0},{"$f":"D42*Impostos!$C$19","v":0},0,0,null,null,""]
[null,null,null,null,{"$f":"D43*Impostos!$C$15","v":0},{"$f":"D43*Impostos!$C$16","v":0},{"$f":"D43*Impostos!$C$17","v":0},{"$f":"D43*Impostos!$C$18","v":0},{"$f":"D43*Impostos!$C$19","v":0},0,0,null,null,""]
[null,null,null,null,{"$f":"D44*Impostos!$C$15","v":0},{"$f":"D44*Impostos!$C$16","v":0},{"$f":"D44*Impostos!$C$17","v":0},{"$f":"D44*Impostos!$C$18","v":0},{"$f":"D44*Impostos!$C$19","v":0},0,0,null,null,""]
[null,null,null,null,{"$f":"D45*Impostos!$C$15","v":0},{"$f":"D45*Impostos!$C$16","v":0},{"$f":"D45*Impostos!$C$17","v":0},{"$f":"D45*Impostos!$C$18","v":0},{"$f":"D45*Impostos!$C$19","v":0},0,0,null,null,""]
[null,null,null,null,{"$f":"D46*Impostos!$C$15","v":0},{"$f":"D46*Impostos!$C$16","v":0},{"$f":"D46*Impostos!$C$17","v":0},{"$f":"D46*Impostos!$C$18","v":0},{"$f":"D46*Impostos!$C$19","v":0},0,0,null,null,""]
[null,null,null,null,{"$f":"D47*Impostos!$C$15","v":0},{"$f":"D47*Impostos!$C$16","v":0},{"$f":"D47*Impostos!$C$17","v":0},{"$f":"D47*Impostos!$C$18","v":0},{"$f":"D47*Impostos!$C$19","v":0},0,0,null,null,""]
[null,null,null,null,{"$f":"D48*Impostos!$C$15","v":0},{"$f":"D48*Impostos!$C$16","v":0},{"$f":"D48*Impostos!$C$17","v":0},{"$f":"D48*Impostos!$C$18","v":0},{"$f":"D48*Impostos!$C$19","v":0},0,0,null,null,""]
[null,null,null,null,{"$f":"D49*Impostos!$C$15","v":0},{"$f":"D49*Impostos!$C$16","v":0},{"$f":"D49*Impostos!$C$17","v":0},{"$f":"D49*Impostos!$C$18","v":0},{"$f":"D49*Impostos!$C$19","v":0},0,0,null,null,""]
[null,null,null,null,{"$f":"D50*Impostos!$C$15","v":0},{"$f":"D50*Impostos!$C$16","v":0},{"$f":"D50*Impostos!$C$17","v":0},{"$f":"D50*Impostos!$C$18","v":0},{"$f":"D50*Impostos!$C$19","v":0},0,0,null,null,""]
[null,null,null,null,{"$f":"D51*Impostos!$C$15","v":0},{"$f":"D51*Impostos!$C$16","v":0},{"$f":"D51*Impostos!$C$17","v":0},{"$f":"D51*Impostos!$C$18","v":0},{"$f":"D51*Impostos!$C$19","v":0},0,0,null,null,""]
[null,null,null,null,{"$f":"D52*Impostos!$C$15","v":0},{"$f":"D52*Impostos!$C$16","v":0},{"$f":"D52*Impostos!$C$17","v":0},{"$f":"D52*Impostos!$C$18","v":0},{"$f":"D52*Impostos!$C$19","v":0},0,0,null,null,""]
[null,null,null,null,{"$f":"D53*Impostos!$C$15","v":0},{"$f":"D53*Impostos!$C$16","v":0},{"$f":"D53*Impostos!$C$17","v":0},{"$f":"D53*Impostos!$C$18","v":0},{"$f":"D53*Impostos!$C$19","v":0},0,0,null,null,""]
[null,null,null,null,{"$f":"D54*Impostos!$C$15","v":0},{"$f":"D54*Impostos!$C$16","v":0},{"$f":"D54*Impostos!$C$17","v":0},{"$f":"D54*Impostos!$C$18","v":0},{"$f":"D54*Impostos!$C$19","v":0},0,0,null,null,""]
[null,null,null,null,{"$f":"D55*Impostos!$C$15","v":0},{"$f":"D55*Impostos!$C$16","v":0},{"$f":"D55*Impostos!$C$17","v":0},{"$f":"D55*Impostos!$C$18","v":0},{"$f":"D55*Impostos!$C$19","v":0},0,0,null,null,""]
[null,null,null,null,{"$f":"D56*Impostos!$C$15","v":0},{"$f":"D56*Impostos!$C$16","v":0},{"$f":"D56*Impostos!$C$17","v":0},{"$f":"D56*Impostos!$C$18","v":0},{"$f":"D56*Impostos!$C$19","v":0},0,0,null,null,""]
[null,null,null,null,{"$f":"D57*Impostos!$C$15","v":0},{"$f":"D57*Impostos!$C$16","v":0},{"$f":"D57*Impostos!$C$17","v":0},{"$f":"D57*Impostos!$C$18","v":0},{"$f":"D57*Impostos!$C$19","v":0},0,0,null,null,""]
[null,null,null,null,{"$f":"D58*Impostos!$C$15","v":0},{"$f":"D58*Impostos!$C$16","v":0},{"$f":"D58*Impostos!$C$17","v":0},{"$f":"D58*Impostos!$C$18","v":0},{"$f":"D58*Impostos!$C$19","v":0},0,0,null,null,""]
[null,null,null,null,{"$f":"D59*Impostos!$C$15","v":0},{"$f":"D59*Impostos!$C$16","v":0},{"$f":"D59*Impostos!$C$17","v":0},{"$f":"D59*Impostos!$C$18","v":0},{"$f":"D59*Impostos!$C$19","v":0},0,0,null,null,""]
[null,null,null,null,{"$f":"D60*Impostos!$C$15","v":0},{"$f":"D60*Impostos!$C$16","v":0},{"$f":"D60*Impostos!$C$17","v":0},{"$f":"D60*Impostos!$C$18","v":0},{"$f":"D60*Impostos!$C$19","v":0},0,0,null,null,""]
[null,null,null,null,{"$f":"D61*Impostos!$C$15","v":0},{"$f":"D61*Impostos!$C$16","v":0},{"$f":"D61*Impostos!$C$17","v":0},{"$f":"D61*Impostos!$C$18","v":0},{"$f":"D61*Impostos!$C$19","v":0},0,0,null,null,""]
[null,null,null,null,{"$f":"D62*Impostos!$C$15","v":0},{"$f":"D62*Impostos!$C$16","v":0},{"$f":"D62*Impostos!$C$17","v":0},{"$f":"D62*Impostos!$C$18","v":0},{"$f":"D62*Impostos!$C$19","v":0},0,0,null,null,""]
[null,null,null,null,{"$f":"D63*Impostos!$C$15","v":0},{"$f":"D63*Impostos!$C$16","v":0},{"$f":"D63*Impostos!$C$17","v":0},{"$f":"D63*Impostos!$C$18","v":0},{"$f":"D63*Impostos!$C$19","v":0},0,0,null,null,""]
[null,null,null,null,{"$f":"D64*Impostos!$C$15","v":0},{"$f":"D64*Impostos!$C$16","v":0},{"$f":"D64*Impostos!$C$17","v":0},{"$f":"D64*Impostos!$C$18","v":0},{"$f":"D64*Impostos!$C$19","v":0},0,0,null,null,""]
[null,null,null,null,{"$f":"D65*Impostos!$C$15","v":0},{"$f":"D65*Impostos!$C$16","v":0},{"$f":"D65*Impostos!$C$17","v":0},{"$f":"D65*Impostos!$C$18","v":0},{"$f":"D65*Impostos!$C$19","v":0},0,0,null,null,""]
[null,null,null,null,{"$f":"D66*Impostos!$C$15","v":0},{"$f":"D66*Impostos!$C$16","v":0},{"$f":"D66*Impostos!$C$17","v":0},{"$f":"D66*Impostos!$C$18","v":0},{"$f":"D66*Impostos!$C$19","v":0},0,0,null,null,""]
[null,null,null,null,{"$f":"D67*Impostos!$C$15","v":0},{"$f":"D67*Impostos!$C$16","v":0},{"$f":"D67*Impostos!$C$17","v":0},{"$f":"D67*Impostos!$C$18","v":0},{"$f":"D67*Impostos!$C$19","v":0},0,0,null,null,""]
[null,null,null,null,{"$f":"D68*Impostos!$C$15","v":0},{"$f":"D68*Impostos!$C$16","v":0},{"$f":"D68*Impostos!$C$17","v":0},{"$f":"D68*Impostos!$C$18","v":0},{"$f":"D68*Impostos!$C$19","v":0},0,0,null,null,""]
[null,null,null,null,{"$f":"D69*Impostos!$C$15","v":0},{"$f":"D69*Impostos!$C$16","v":0},{"$f":"D69*Impostos!$C$17","v":0},{"$f":"D69*Impostos!$C$18","v":0},{"$f":"D69*Impostos!$C$19","v":0},0,0,null,null,""]
[null,null,null,null,{"$f":"D70*Impostos!$C$15","v":0},{"$f":"D70*Impostos!$C$16","v":0},{"$f":"D70*Impostos!$C$17","v":0},{"$f":"D70*Impostos!$C$18","v":0},{"$f":"D70*Impostos!$C$19","v":0},0,0,null,null,""]
[null,null,null,null,{"$f":"D71*Impostos!$C$15","v":0},{"$f":"D71*Impostos!$C$16","v":0},{"$f":"D71*Impostos!$C$17","v":0},{"$f":"D71*Impostos!$C$18","v":0},{"$f":"D71*Impostos!$C$19","v":0},0,0,null,null,""]
[null,null,null,null,{"$f":"D72*Impostos!$C$15","v":0},{"$f":"D72*Impostos!$C$16","v":0},{"$f":"D72*Impostos!$C$17","v":0},{"$f":"D72*Impostos!$C$18","v":0},{"$f":"D72*Impostos!$C$19","v":0},0,0,null,null,""]
[null,null,null,null,{"$f":"D73*Impostos!$C$15","v":0},{"$f":"D73*Impostos!$C$16","v":0},{"$f":"D73*Impostos!$C$17","v":0},{"$f":"D73*Impostos!$C$18","v":0},{"$f":"D73*Impostos!$C$19","v":0},0,0,null,null,""]
[null,null,null,null,{"$f":"D74*Impostos!$C$15","v":0},{"$f":"D74*Impostos!$C$16","v":0},{"$f":"D74*Impostos!$C$17","v":0},{"$f":"D74*Impostos!$C$18","v":0},{"$f":"D74*Impostos!$C$19","v":0},0,0,null,null,""]
[null,null,null,null,{"$f":"D75*Impostos!$C$15","v":0},{"$f":"D75*Impostos!$C$16","v":0},{"$f":"D75*Impostos!$C$17","v":0},{"$f":"D75*Impostos!$C$18","v":0},{"$f":"D75*Impostos!$C$19","v":0},0,0,null,null,""]
[null,null,null,null,{"$f":"D76*Impostos!$C$15","v":0},{"$f":"D76*Impostos!$C$16","v":0},{"$f":"D76*Impostos!$C$17","v":0},{"$f":"D76*Impostos!$C$18","v":0},{"$f":"D76*Impostos!$C$19","v":0},0,0,null,null,""]
[null,null,null,null,{"$f":"D77*Impostos!$C$15","v":0},{"$f":"D77*Impostos!$C$16","v":0},{"$f":"D77*Impostos!$C$17","v":0},{"$f":"D77*Impostos!$C$18","v":0},{"$f":"D77*Impostos!$C$19","v":0},0,0,null,null,""]
[null,null,null,null,{"$f":"D78*Impostos!$C$15","v":0},{"$f":"D78*Impostos!$C$16","v":0},{"$f":"D78*Impostos!$C$17","v":0},{"$f":"D78*Impostos!$C$18","v":0},{"$f":"D78*Impostos!$C$19","v":0},0,0,null,null,""]
[null,null,null,null,{"$f":"D79*Impostos!$C$15","v":0},{"$f":"D79*Impostos!$C$16","v":0},{"$f":"D79*Impostos!$C$17","v":0},{"$f":"D79*Impostos!$C$18","v":0},{"$f":"D79*Impostos!$C$19","v":0},0,0,null,null,""]
[null,null,null,null,{"$f":"D80*Impostos!$C$15","v":0},{"$f":"D80*Impostos!$C$16","v":0},{"$f":"D80*Impostos!$C$17","v":0},{"$f":"D80*Impostos!$C$18","v":0},{"$f":"D80*Impostos!$C$19","v":0},0,0,null,null,{"$f":"IF(C80=\"\",\"\",MONTH(C80))","v":""}]
[null,null,null,null,{"$f":"D81*Impostos!$C$15","v":0},{"$f":"D81*Impostos!$C$16","v":0},{"$f":"D81*Impostos!$C$17","v":0},{"$f":"D81*Impostos!$C$18","v":0},{"$f":"D81*Impostos!$C$19","v":0},0,0,null,null,""]
[null,null,null,null,{"$f":"D82*Impostos!$C$15","v":0},{"$f":"D82*Impostos!$C$16","v":0},{"$f":"D82*Impostos!$C$17","v":0},{"$f":"D82*Impostos!$C$18","v":0},{"$f":"D82*Impostos!$C$19","v":0},0,0,null,null,""]
[null,null,null,null,{"$f":"D83*Impostos!$C$15","v":0},{"$f":"D83*Impostos!$C$16","v":0},{"$f":"D83*Impostos!$C$17","v":0},{"$f":"D83*Impostos!$C$18","v":0},{"$f":"D83*Impostos!$C$19","v":0},0,0,null,null,""]
[null,null,null,null,{"$f":"D84*Impostos!$C$15","v":0},{"$f":"D84*Impostos!$C$16","v":0},{"$f":"D84*Impostos!$C$17","v":0},{"$f":"D84*Impostos!$C$18","v":0},{"$f":"D84*Impostos!$C$19","v":0},{"$f":"SUM(E84:I84)","v":0},{"$f":"D84-J84","v":0},null,null,""]
[null,null,null,null,{"$f":"D85*Impostos!$C$15","v":0},{"$f":"D85*Impostos!$C$16","v":0},{"$f":"D85*Impostos!$C$17","v":0},{"$f":"D85*Impostos!$C$18","v":0},{"$f":"D85*Impostos!$C$19","v":0},0,0,null,null,""]
[null,null,null,null,{"$f":"D86*Impostos!$C$15","v":0},{"$f":"D86*Impostos!$C$16","v":0},{"$f":"D86*Impostos!$C$17","v":0},{"$f":"D86*Impostos!$C$18","v":0},{"$f":"D86*Impostos!$C$19","v":0},0,0,null,null,""]
[null,null,null,null,{"$f":"D87*Impostos!$C$15","v":0},{"$f":"D87*Impostos!$C$16","v":0},{"$f":"D87*Impostos!$C$17","v":0},{"$f":"D87*Impostos!$C$18","v":0},{"$f":"D87*Impostos!$C$19","v":0},0,0,null,null,""]
[null,null,null,null,{"$f":"D88*Impostos!$C$15","v":0},{"$f":"D88*Impostos!$C$16","v":0},{"$f":"D88*Impostos!$C$17","v":0},{"$f":"D88*Impostos!$C$18","v":0},{"$f":"D88*Impostos!$C$19","v":0},{"$f":"SUM(E88:I88)","v":0},{"$f":"D88-J88","v":0},null,null,""]
[null,null,null,null,{"$f":"D89*Impostos!$C$15","v":0},{"$f":"D89*Impostos!$C$16","v":0},{"$f":"D89*Impostos!$C$17","v":0},{"$f":"D89*Impostos!$C$18","v":0},{"$f":"D89*Impostos!$C$19","v":0},0,0,null,null,""]
[null,null,null,null,{"$f":"D90*Impostos!$C$15","v":0},{"$f":"D90*Impostos!$C$16","v":0},{"$f":"D90*Impostos!$C$17","v":0},{"$f":"D90*Impostos!$C$18","v":0},{"$f":"D90*Impostos!$C$19","v":0},0,0,null,null,""]
[null,null,null,null,{"$f":"D91*Impostos!$C$15","v":0},{"$f":"D91*Impostos!$C$16","v":0},{"$f":"D91*Impostos!$C$17","v":0},{"$f":"D91*Impostos!$C$18","v":0},{"$f":"D91*Impostos!$C$19","v":0},0,0,null,null,""]
[null,null,null,null,{"$f":"D92*Impostos!$C$15","v":0},{"$f":"D92*Impostos!$C$16","v":0},{"$f":"D92*Impostos!$C$17","v":0},{"$f":"D92*Impostos!$C$18","v":0},{"$f":"D92*Impostos!$C$19","v":0},0,0,null,null,""]
[null,null,null,null,{"$f":"D93*Impostos!$C$15","v":0},{"$f":"D93*Impostos!$C$16","v":0},{"$f":"D93*Impostos!$C$17","v":0},{"$f":"D93*Impostos!$C$18","v":0},{"$f":"D93*Impostos!$C$19","v":0},0,0,null,null,""]
[null,null,null,null,{"$f":"D94*Impostos!$C$15","v":0},{"$f":"D94*Impostos!$C$16","v":0},{"$f":"D94*Impostos!$C$17","v":0},{"$f":"D94*Impostos!$C$18","v":0},{"$f":"D94*Impostos!$C$19","v":0},0,0,null,null,""]
[null,null,null,null,{"$f":"D95*Impostos!$C$15","v":0},{"$f":"D95*Impostos!$C$16","v":0},{"$f":"D95*Impostos!$C$17","v":0},{"$f":"D95*Impostos!$C$18","v":0},{"$f":"D95*Impostos!$C$19","v":0},0,0,null,null,""]
[null,null,null,null,{"$f":"D96*Impostos!$C$15","v":0},{"$f":"D96*Impostos!$C$16","v":0},{"$f":"D96*Impostos!$C$17","v":0},{"$f":"D96*Impostos!$C$18","v":0},{"$f":"D96*Impostos!$C$19","v":0},0,0,null,null,""]
[null,null,null,null,{"$f":"D97*Impostos!$C$15","v":0},{"$f":"D97*Impostos!$C$16","v":0},{"$f":"D97*Impostos!$C$17","v":0},{"$f":"D97*Impostos!$C$18","v":0},{"$f":"D97*Impostos!$C$19","v":0},0,0,null,null,""]
[null,null,null,null,{"$f":"D98*Impostos!$C$15","v":0},{"$f":"D98*Impostos!$C$16","v":0},{"$f":"D98*Impostos!$C$17","v":0},{"$f":"D98*Impostos!$C$18","v":0},{"$f":"D98*Impostos!$C$19","v":0},0,0,null,null,""]
[null,null,null,null,{"$f":"D99*Impostos!$C$15","v":0},{"$f":"D99*Impostos!$C$16","v":0},{"$f":"D99*Impostos!$C$17","v":0},{"$f":"D99*Impostos!$C$18","v":0},{"$f":"D99*Impostos!$C$19","v":0},0,0,null,null,""]
[null,null,null,null,{"$f":"D100*Impostos!$C$15","v":0},{"$f":"D100*Impostos!$C$16","v":0},{"$f":"D100*Impostos!$C$17","v":0},{"$f":"D100*Impostos!$C$18","v":0},{"$f":"D100*Impostos!$C$19","v":0},0,0,null,null,""]
[null,null,null,null,{"$f":"D101*Impostos!$C$15","v":0},{"$f":"D101*Impostos!$C$16","v":0},{"$f":"D101*Impostos!$C$17","v":0},{"$f":"D101*Impostos!$C$18","v":0},{"$f":"D101*Impostos!$C$19","v":0},0,0,null,null,""]
[null,null,null,null,{"$f":"D102*Impostos!$C$15","v":0},{"$f":"D102*Impostos!$C$16","v":0},{"$f":"D102*Impostos!$C$17","v":0},{"$f":"D102*Impostos!$C$18","v":0},{"$f":"D102*Impostos!$C$19","v":0},0,0,null,null,""]
[null,null,null,null,{"$f":"D103*Impostos!$C$15","v":0},{"$f":"D103*Impostos!$C$16","v":0},{"$f":"D103*Impostos!$C$17","v":0},{"$f":"D103*Impostos!$C$18","v":0},{"$f":"D103*Impostos!$C$19","v":0},0,0,null,null,""]
[null,null,null,null,{"$f":"D104*Impostos!$C$15","v":0},{"$f":"D104*Impostos!$C$16","v":0},{"$f":"D104*Impostos!$C$17","v":0},{"$f":"D104*Impostos!$C$18","v":0},{"$f":"D104*Impostos!$C$19","v":0},0,0,null,null,""]
[null,null,null,null,{"$f":"D105*Impostos!$C$15","v":0},{"$f":"D105*Impostos!$C$16","v":0},{"$f":"D105*Impostos!$C$17","v":0},{"$f":"D105*Impostos!$C$18","v":0},{"$f":"D105*Impostos!$C$19","v":0},0,0,null,null,""]
[null,null,null,null,{"$f":"D106*Impostos!$C$15","v":0},{"$f":"D106*Impostos!$C$16","v":0},{"$f":"D106*Impostos!$C$17","v":0},{"$f":"D106*Impostos!$C$18","v":0},{"$f":"D106*Impostos!$C$19","v":0},0,0,null,null,""]
[null,null,null,null,{"$f":"D107*Impostos!$C$15","v":0},{"$f":"D107*Impostos!$C$16","v":0},{"$f":"D107*Impostos!$C$17","v":0},{"$f":"D107*Impostos!$C$18","v":0},{"$f":"D107*Impostos!$C$19","v":0},0,0,null,null,""]
[null,null,null,null,{"$f":"D108*Impostos!$C$15","v":0},{"$f":"D108*Impostos!$C$16","v":0},{"$f":"D108*Impostos!$C$17","v":0},{"$f":"D108*Impostos!$C$18","v":0},{"$f":"D108*Impostos!$C$19","v":0},0,0,null,null,""]
[null,null,null,null,{"$f":"D109*Impostos!$C$15","v":0},{"$f":"D109*Impostos!$C$16","v":0},{"$f":"D109*Impostos!$C$17","v":0},{"$f":"D109*Impostos!$C$18","v":0},{"$f":"D109*Impostos!$C$19","v":0},0,0,null,null,""]
[null,null,null,null,{"$f":"D110*Impostos!$C$15","v":0},{"$f":"D110*Impostos!$C$16","v":0},{"$f":"D110*Impostos!$C$17","v":0},{"$f":"D110*Impostos!$C$18","v":0},{"$f":"D110*Impostos!$C$19","v":0},0,0,null,null,""]
[null,null,null,null,{"$f":"D111*Impostos!$C$15","v":0},{"$f":"D111*Impostos!$C$16","v":0},{"$f":"D111*Impostos!$C$17","v":0},{"$f":"D111*Impostos!$C$18","v":0},{"$f":"D111*Impostos!$C$19","v":0},0,0,null,null,""]
[null,null,null,null,{"$f":"D112*Impostos!$C$15","v":0},{"$f":"D112*Impostos!$C$16","v":0},{"$f":"D112*Impostos!$C$17","v":0},{"$f":"D112*Impostos!$C$18","v":0},{"$f":"D112*Impostos!$C$19","v":0},0,0,null,null,""]
[null,null,null,null,{"$f":"D113*Impostos!$C$15","v":0},{"$f":"D113*Impostos!$C$16","v":0},{"$f":"D113*Impostos!$C$17","v":0},{"$f":"D113*Impostos!$C$18","v":0},{"$f":"D113*Impostos!$C$19","v":0},0,0,null,null,""]
[null,null,null,null,{"$f":"D114*Impostos!$C$15","v":0},{"$f":"D114*Impostos!$C$16","v":0},{"$f":"D114*Impostos!$C$17","v":0},{"$f":"D114*Impostos!$C$18","v":0},{"$f":"D114*Impostos!$C$19","v":0},0,0,null,null,""]
[null,null,null,null,{"$f":"D115*Impostos!$C$15","v":0},{"$f":"D115*Impostos!$C$16","v":0},{"$f":"D115*Impostos!$C$17","v":0},{"$f":"D115*Impostos!$C$18","v":0},{"$f":"D115*Impostos!$C$19","v":0},0,0,null,null,""]
[null,null,null,null,{"$f":"D116*Impostos!$C$15","v":0},{"$f":"D116*Impostos!$C$16","v":0},{"$f":"D116*Impostos!$C$17","v":0},{"$f":"D116*Impostos!$C$18","v":0},{"$f":"D116*Impostos!$C$19","v":0},0,0,null,null,""]
[null,null,null,null,{"$f":"D117*Impostos!$C$15","v":0},{"$f":"D117*Impostos!$C$16","v":0},{"$f":"D117*Impostos!$C$17","v":0},{"$f":"D117*Impostos!$C$18","v":0},{"$f":"D117*Impostos!$C$19","v":0},0,0,null,null,""]
[null,null,null,null,{"$f":"D118*Impostos!$C$15","v":0},{"$f":"D118*Impostos!$C$16","v":0},{"$f":"D118*Impostos!$C$17","v":0},{"$f":"D118*Impostos!$C$18","v":0},{"$f":"D118*Impostos!$C$19","v":0},0,0,null,null,""]
[null,null,null,null,{"$f":"D119*Impostos!$C$15","v":0},{"$f":"D119*Impostos!$C$16","v":0},{"$f":"D119*Impostos!$C$17","v":0},{"$f":"D119*Impostos!$C$18","v":0},{"$f":"D119*Impostos!$C$19","v":0},0,0,null,null,""]
[null,null,null,null,{"$f":"D120*Impostos!$C$15","v":0},{"$f":"D120*Impostos!$C$16","v":0},{"$f":"D120*Impostos!$C$17","v":0},{"$f":"D120*Impostos!$C$18","v":0},{"$f":"D120*Impostos!$C$19","v":0},0,0,null,null,""]
[null,null,null,null,{"$f":"D121*Impostos!$C$15","v":0},{"$f":"D121*Impostos!$C$16","v":0},{"$f":"D121*Impostos!$C$17","v":0},{"$f":"D121*Impostos!$C$18","v":0},{"$f":"D121*Impostos!$C$19","v":0},0,0,null,null,""]
[null,null,null,null,{"$f":"D122*Impostos!$C$15","v":0},{"$f":"D122*Impostos!$C$16","v":0},{"$f":"D122*Impostos!$C$17","v":0},{"$f":"D122*Impostos!$C$18","v":0},{"$f":"D122*Impostos!$C$19","v":0},0,0,null,null,""]
[null,null,null,null,{"$f":"D123*Impostos!$C$15","v":0},{"$f":"D123*Impostos!$C$16","v":0},{"$f":"D123*Impostos!$C$17","v":0},{"$f":"D123*Impostos!$C$18","v":0},{"$f":"D123*Impostos!$C$19","v":0},0,0,null,null,""]
[null,null,null,null,{"$f":"D124*Impostos!$C$15","v":0},{"$f":"D124*Impostos!$C$16","v":0},{"$f":"D124*Impostos!$C$17","v":0},{"$f":"D124*Impostos!$C$18","v":0},{"$f":"D124*Impostos!$C$19","v":0},0,0,null,null,""]
[null,null,null,null,{"$f":"D125*Impostos!$C$15","v":0},{"$f":"D125*Impostos!$C$16","v":0},{"$f":"D125*Impostos!$C$17","v":0},{"$f":"D125*Impostos!$C$18","v":0},{"$f":"D125*Impostos!$C$19","v":0},0,0,null,null,""]
[null,null,null,null,{"$f":"D126*Impostos!$C$15","v":0},{"$f":"D126*Impostos!$C$16","v":0},{"$f":"D126*Impostos!$C$17","v":0},{"$f":"D126*Impostos!$C$18","v":0},{"$f":"D126*Impostos!$C$19","v":0},0,0,null,null,""]
[null,null,null,null,{"$f":"D127*Impostos!$C$15","v":0},{"$f":"D127*Impostos!$C$16","v":0},{"$f":"D127*Impostos!$C$17","v":0},{"$f":"D127*Impostos!$C$18","v":0},{"$f":"D127*Impostos!$C$19","v":0},0,0,null,null,""]
[null,null,null,null,{"$f":"D128*Impostos!$C$15","v":0},{"$f":"D128*Impostos!$C$16","v":0},{"$f":"D128*Impostos!$C$17","v":0},{"$f":"D128*Impostos!$C$18","v":0},{"$f":"D128*Impostos!$C$19","v":0},0,0,null,null,""]
[null,null,null,null,{"$f":"D129*Impostos!$C$15","v":0},{"$f":"D129*Impostos!$C$16","v":0},{"$f":"D129*Impostos!$C$17","v":0},{"$f":"D129*Impostos!$C$18","v":0},{"$f":"D129*Impostos!$C$19","v":0},0,0,null,null,""]
[null,null,null,null,{"$f":"D130*Impostos!$C$15","v":0},{"$f":"D130*Impostos!$C$16","v":0},{"$f":"D130*Impostos!$C$17","v":0},{"$f":"D130*Impostos!$C$18","v":0},{"$f":"D130*Impostos!$C$19","v":0},0,0,null,null,""]
[null,null,null,null,{"$f":"D131*Impostos!$C$15","v":0},{"$f":"D131*Impostos!$C$16","v":0},{"$f":"D131*Impostos!$C$17","v":0},{"$f":"D131*Impostos!$C$18","v":0},{"$f":"D131*Impostos!$C$19","v":0},0,0,null,null,""]
[null,null,null,null,{"$f":"D132*Impostos!$C$15","v":0},{"$f":"D132*Impostos!$C$16","v":0},{"$f":"D132*Impostos!$C$17","v":0},{"$f":"D132*Impostos!$C$18","v":0},{"$f":"D132*Impostos!$C$19","v":0},0,0,null,null,""]
[null,null,null,null,{"$f":"D133*Impostos!$C$15","v":0},{"$f":"D133*Impostos!$C$16","v":0},{"$f":"D133*Impostos!$C$17","v":0},{"$f":"D133*Impostos!$C$18","v":0},{"$f":"D133*Impostos!$C$19","v":0},0,0,null,null,""]
[null,null,null,null,{"$f":"D134*Impostos!$C$15","v":0},{"$f":"D134*Impostos!$C$16","v":0},{"$f":"D134*Impostos!$C$17","v":0},{"$f":"D134*Impostos!$C$18","v":0},{"$f":"D134*Impostos!$C$19","v":0},0,0,null,null,""]
[null,null,null,null,{"$f":"D135*Impostos!$C$15","v":0},{"$f":"D135*Impostos!$C$16","v":0},{"$f":"D135*Impostos!$C$17","v":0},{"$f":"D135*Impostos!$C$18","v":0},{"$f":"D135*Impostos!$C$19","v":0},0,0,null,null,""]
[null,null,null,null,{"$f":"D136*Impostos!$C$15","v":0},{"$f":"D136*Impostos!$C$16","v":0},{"$f":"D136*Impostos!$C$17","v":0},{"$f":"D136*Impostos!$C$18","v":0},{"$f":"D136*Impostos!$C$19","v":0},0,0,null,null,""]
[null,null,null,null,{"$f":"D137*Impostos!$C$15","v":0},{"$f":"D137*Impostos!$C$16","v":0},{"$f":"D137*Impostos!$C$17","v":0},{"$f":"D137*Impostos!$C$18","v":0},{"$f":"D137*Impostos!$C$19","v":0},0,0,null,null,""]
[null,null,null,null,{"$f":"D138*Impostos!$C$15","v":0},{"$f":"D138*Impostos!$C$16","v":0},{"$f":"D138*Impostos!$C$17","v":0},{"$f":"D138*Impostos!$C$18","v":0},{"$f":"D138*Impostos!$C$19","v":0},0,0,null,null,""]
[null,null,null,null,{"$f":"D139*Impostos!$C$15","v":0},{"$f":"D139*Impostos!$C$16","v":0},{"$f":"D139*Impostos!$C$17","v":0},{"$f":"D139*Impostos!$C$18","v":0},{"$f":"D139*Impostos!$C$19","v":0},0,0,null,null,""]
[null,null,null,null,{"$f":"D140*Impostos!$C$15","v":0},{"$f":"D140*Impostos!$C$16","v":0},{"$f":"D140*Impostos!$C$17","v":0},{"$f":"D140*Impostos!$C$18","v":0},{"$f":"D140*Impostos!$C$19","v":0},0,0,null,null,""]
[null,null,null,null,{"$f":"D141*Impostos!$C$15","v":0},{"$f":"D141*Impostos!$C$16","v":0},{"$f":"D141*Impostos!$C$17","v":0},{"$f":"D141*Impostos!$C$18","v":0},{"$f":"D141*Impostos!$C$19","v":0},0,0,null,null,""]
[null,null,null,null,{"$f":"D142*Impostos!$C$15","v":0},{"$f":"D142*Impostos!$C$16","v":0},{"$f":"D142*Impostos!$C$17","v":0},{"$f":"D142*Impostos!$C$18","v":0},{"$f":"D142*Impostos!$C$19","v":0},0,0,null,null,""]
[null,null,null,null,{"$f":"D143*Impostos!$C$15","v":0},{"$f":"D143*Impostos!$C$16","v":0},{"$f":"D143*Impostos!$C$17","v":0},{"$f":"D143*Impostos!$C$18","v":0},{"$f":"D143*Impostos!$C$19","v":0},0,0,null,null,""]
[null,null,null,null,{"$f":"D144*Impostos!$C$15","v":0},{"$f":"D144*Impostos!$C$16","v":0},{"$f":"D144*Impostos!$C$17","v":0},{"$f":"D144*Impostos!$C$18","v":0},{"$f":"D144*Impostos!$C$19","v":0},0,0,null,null,{"$f":"IF(C144=\"\",\"\",MONTH(C144))","v":""}]
[null,null,null,null,{"$f":"D145*Impostos!$C$15","v":0},{"$f":"D145*Impostos!$C$16","v":0},{"$f":"D145*Impostos!$C$17","v":0},{"$f":"D145*Impostos!$C$18","v":0},{"$f":"D145*Impostos!$C$19","v":0},0,0,null,null,""]
[null,null,null,null,{"$f":"D146*Impostos!$C$15","v":0},{"$f":"D146*Impostos!$C$16","v":0},{"$f":"D146*Impostos!$C$17","v":0},{"$f":"D146*Impostos!$C$18","v":0},{"$f":"D146*Impostos!$C$19","v":0},0,0,null,null,""]
[null,null,null,null,{"$f":"D147*Impostos!$C$15","v":0},{"$f":"D147*Impostos!$C$16","v":0},{"$f":"D147*Impostos!$C$17","v":0},{"$f":"D147*Impostos!$C$18","v":0},{"$f":"D147*Impostos!$C$19","v":0},0,0,null,null,""]
[null,null,null,null,{"$f":"D148*Impostos!$C$15","v":0},{"$f":"D148*Impostos!$C$16","v":0},{"$f":"D148*Impostos!$C$17","v":0},{"$f":"D148*Impostos!$C$18","v":0},{"$f":"D148*Impostos!$C$19","v":0},0,0,null,null,""]
[null,null,null,null,{"$f":"D149*Impostos!$C$15","v":0},{"$f":"D149*Impostos!$C$16","v":0},{"$f":"D149*Impostos!$C$17","v":0},{"$f":"D149*Impostos!$C$18","v":0},{"$f":"D149*Impostos!$C$19","v":0},0,0,null,null,""]
[null,null,null,null,{"$f":"D150*Impostos!$C$15","v":0},{"$f":"D150*Impostos!$C$16","v":0},{"$f":"D150*Impostos!$C$17","v":0},{"$f":"D150*Impostos!$C$18","v":0},{"$f":"D150*Impostos!$C$19","v":0},0,0,null,null,""]
[null,null,null,null,{"$f":"D151*Impostos!$C$15","v":0},{"$f":"D151*Impostos!$C$16","v":0},{"$f":"D151*Impostos!$C$17","v":0},{"$f":"D151*Impostos!$C$18","v":0},{"$f":"D151*Impostos!$C$19","v":0},0,0,null,null,""]
[null,null,null,null,{"$f":"D152*Impostos!$C$15","v":0},{"$f":"D152*Impostos!$C$16","v":0},{"$f":"D152*Impostos!$C$17","v":0},{"$f":"D152*Impostos!$C$18","v":0},{"$f":"D152*Impostos!$C$19","v":0},{"$f":"SUM(E152:I152)","v":0},{"$f":"D152-J152","v":0},null,null,""]
[null,null,null,null,{"$f":"D153*Impostos!$C$15","v":0},{"$f":"D153*Impostos!$C$16","v":0},{"$f":"D153*Impostos!$C$17","v":0},{"$f":"D153*Impostos!$C$18","v":0},{"$f":"D153*Impostos!$C$19","v":0},0,0,null,null,""]
[null,null,null,null,{"$f":"D154*Impostos!$C$15","v":0},{"$f":"D154*Impostos!$C$16","v":0},{"$f":"D154*Impostos!$C$17","v":0},{"$f":"D154*Impostos!$C$18","v":0},{"$f":"D154*Impostos!$C$19","v":0},0,0,null,null,""]
[null,null,null,null,{"$f":"D155*Impostos!$C$15","v":0},{"$f":"D155*Impostos!$C$16","v":0},{"$f":"D155*Impostos!$C$17","v":0},{"$f":"D155*Impostos!$C$18","v":0},{"$f":"D155*Impostos!$C$19","v":0},0,0,null,null,""]
[null,null,null,null,{"$f":"D156*Impostos!$C$15","v":0},{"$f":"D156*Impostos!$C$16","v":0},{"$f":"D156*Impostos!$C$17","v":0},{"$f":"D156*Impostos!$C$18","v":0},{"$f":"D156*Impostos!$C$19","v":0},0,0,null,null,""]
[null,null,null,null,{"$f":"D157*Impostos!$C$15","v":0},{"$f":"D157*Impostos!$C$16","v":0},{"$f":"D157*Impostos!$C$17","v":0},{"$f":"D157*Impostos!$C$18","v":0},{"$f":"D157*Impostos!$C$19","v":0},0,0,null,null,""]
[null,null,null,null,{"$f":"D158*Impostos!$C$15","v":0},{"$f":"D158*Impostos!$C$16","v":0},{"$f":"D158*Impostos!$C$17","v":0},{"$f":"D158*Impostos!$C$18","v":0},{"$f":"D158*Impostos!$C$19","v":0},0,0,null,null,""]
[null,null,null,null,{"$f":"D159*Impostos!$C$15","v":0},{"$f":"D159*Impostos!$C$16","v":0},{"$f":"D159*Impostos!$C$17","v":0},{"$f":"D159*Impostos!$C$18","v":0},{"$f":"D159*Impostos!$C$19","v":0},0,0,null,null,""]
[null,null,null,null,{"$f":"D160*Impostos!$C$15","v":0},{"$f":"D160*Impostos!$C$16","v":0},{"$f":"D160*Impostos!$C$17","v":0},{"$f":"D160*Impostos!$C$18","v":0},{"$f":"D160*Impostos!$C$19","v":0},0,0,null,null,""]
[null,null,null,null,{"$f":"D161*Impostos!$C$15","v":0},{"$f":"D161*Impostos!$C$16","v":0},{"$f":"D161*Impostos!$C$17","v":0},{"$f":"D161*Impostos!$C$18","v":0},{"$f":"D161*Impostos!$C$19","v":0},0,0,null,null,""]
[null,null,null,null,{"$f":"D162*Impostos!$C$15","v":0},{"$f":"D162*Impostos!$C$16","v":0},{"$f":"D162*Impostos!$C$17","v":0},{"$f":"D162*Impostos!$C$18","v":0},{"$f":"D162*Impostos!$C$19","v":0},0,0,null,null,""]
[null,null,null,null,{"$f":"D163*Impostos!$C$15","v":0},{"$f":"D163*Impostos!$C$16","v":0},{"$f":"D163*Impostos!$C$17","v":0},{"$f":"D163*Impostos!$C$18","v":0},{"$f":"D163*Impostos!$C$19","v":0},0,0,null,null,""]
[null,null,null,null,{"$f":"D164*Impostos!$C$15","v":0},{"$f":"D164*Impostos!$C$16","v":0},{"$f":"D164*Impostos!$C$17","v":0},{"$f":"D164*Impostos!$C$18","v":0},{"$f":"D164*Impostos!$C$19","v":0},0,0,null,null,""]
[null,null,null,null,{"$f":"D165*Impostos!$C$15","v":0},{"$f":"D165*Impostos!$C$16","v":0},{"$f":"D165*Impostos!$C$17","v":0},{"$f":"D165*Impostos!$C$18","v":0},{"$f":"D165*Impostos!$C$19","v":0},0,0,null,null,""]
[null,null,null,null,{"$f":"D166*Impostos!$C$15","v":0},{"$f":"D166*Impostos!$C$16","v":0},{"$f":"D166*Impostos!$C$17","v":0},{"$f":"D166*Impostos!$C$18","v":0},{"$f":"D166*Impostos!$C$19","v":0},0,0,null,null,""]
[null,null,null,null,{"$f":"D167*Impostos!$C$15","v":0},{"$f":"D167*Impostos!$C$16","v":0},{"$f":"D167*Impostos!$C$17","v":0},{"$f":"D167*Impostos!$C$18","v":0},{"$f":"D167*Impostos!$C$19","v":0},0,0,null,null,""]
[null,null,null,null,{"$f":"D168*Impostos!$C$15","v":0},{"$f":"D168*Impostos!$C$16","v":0},{"$f":"D168*Impostos!$C$17","v":0},{"$f":"D168*Impostos!$C$18","v":0},{"$f":"D168*Impostos!$C$19","v":0},0,0,null,null,""]
[null,null,null,null,{"$f":"D169*Impostos!$C$15","v":0},{"$f":"D169*Impostos!$C$16","v":0},{"$f":"D169*Impostos!$C$17","v":0},{"$f":"D169*Impostos!$C$18","v":0},{"$f":"D169*Impostos!$C$19","v":0},0,0,null,null,""]
[null,null,null,null,{"$f":"D170*Impostos!$C$15","v":0},{"$f":"D170*Impostos!$C$16","v":0},{"$f":"D170*Impostos!$C$17","v":0},{"$f":"D170*Impostos!$C$18","v":0},{"$f":"D170*Impostos!$C$19","v":0},0,0,null,null,""]
[null,null,null,null,{"$f":"D171*Impostos!$C$15","v":0},{"$f":"D171*Impostos!$C$16","v":0},{"$f":"D171*Impostos!$C$17","v":0},{"$f":"D171*Impostos!$C$18","v":0},{"$f":"D171*Impostos!$C$19","v":0},0,0,null,null,""]
[null,null,null,null,{"$f":"D172*Impostos!$C$15","v":0},{"$f":"D172*Impostos!$C$16","v":0},{"$f":"D172*Impostos!$C$17","v":0},{"$f":"D172*Impostos!$C$18","v":0},{"$f":"D172*Impostos!$C$19","v":0},0,0,null,null,""]
[null,null,null,null,{"$f":"D173*Impostos!$C$15","v":0},{"$f":"D173*Impostos!$C$16","v":0},{"$f":"D173*Impostos!$C$17","v":0},{"$f":"D173*Impostos!$C$18","v":0},{"$f":"D173*Impostos!$C$19","v":0},0,0,null,null,""]
[null,null,null,null,{"$f":"D174*Impostos!$C$15","v":0},{"$f":"D174*Impostos!$C$16","v":0},{"$f":"D174*Impostos!$C$17","v":0},{"$f":"D174*Impostos!$C$18","v":0},{"$f":"D174*Impostos!$C$19","v":0},0,0,null,null,""]
[null,null,null,null,{"$f":"D175*Impostos!$C$15","v":0},{"$f":"D175*Impostos!$C$16","v":0},{"$f":"D175*Impostos!$C$17","v":0},{"$f":"D175*Impostos!$C$18","v":0},{"$f":"D175*Impostos!$C$19","v":0},0,0,null,null,""]
[null,null,null,null,{"$f":"D176*Impostos!$C$15","v":0},{"$f":"D176*Impostos!$C$16","v":0},{"$f":"D176*Impostos!$C$17","v":0},{"$f":"D176*Impostos!$C$18","v":0},{"$f":"D176*Impostos!$C$19","v":0},0,0,null,null,""]
[null,null,null,null,{"$f":"D177*Impostos!$C$15","v":0},{"$f":"D177*Impostos!$C$16","v":0},{"$f":"D177*Impostos!$C$17","v":0},{"$f":"D177*Impostos!$C$18","v":0},{"$f":"D177*Impostos!$C$19","v":0},0,0,null,null,""]
[null,null,null,null,{"$f":"D178*Impostos!$C$15","v":0},{"$f":"D178*Impostos!$C$16","v":0},{"$f":"D178*Impostos!$C$17","v":0},{"$f":"D178*Impostos!$C$18","v":0},{"$f":"D178*Impostos!$C$19","v":0},0,0,null,null,""]
[null,null,null,null,{"$f":"D179*Impostos!$C$15","v":0},{"$f":"D179*Impostos!$C$16","v":0},{"$f":"D179*Impostos!$C$17","v":0},{"$f":"D179*Impostos!$C$18","v":0},{"$f":"D179*Impostos!$C$19","v":0},0,0,null,null,""]
[null,null,null,null,{"$f":"D180*Impostos!$C$15","v":0},{"$f":"D180*Impostos!$C$16","v":0},{"$f":"D180*Impostos!$C$17","v":0},{"$f":"D180*Impostos!$C$18","v":0},{"$f":"D180*Impostos!$C$19","v":0},0,0,null,null,""]
[null,null,null,null,{"$f":"D181*Impostos!$C$15","v":0},{"$f":"D181*Impostos!$C$16","v":0},{"$f":"D181*Impostos!$C$17","v":0},{"$f":"D181*Impostos!$C$18","v":0},{"$f":"D181*Impostos!$C$19","v":0},0,0,null,null,""]
[null,null,null,null,{"$f":"D182*Impostos!$C$15","v":0},{"$f":"D182*Impostos!$C$16","v":0},{"$f":"D182*Impostos!$C$17","v":0},{"$f":"D182*Impostos!$C$18","v":0},{"$f":"D182*Impostos!$C$19","v":0},0,0,null,null,""]
[null,null,null,null,{"$f":"D183*Impostos!$C$15","v":0},{"$f":"D183*Impostos!$C$16","v":0},{"$f":"D183*Impostos!$C$17","v":0},{"$f":"D183*Impostos!$C$18","v":0},{"$f":"D183*Impostos!$C$19","v":0},0,0,null,null,""]
[null,null,null,null,{"$f":"D184*Impostos!$C$15","v":0},{"$f":"D184*Impostos!$C$16","v":0},{"$f":"D184*Impostos!$C$17","v":0},{"$f":"D184*Impostos!$C$18","v":0},{"$f":"D184*Impostos!$C$19","v":0},0,0,null,null,""]
[null,null,null,null,{"$f":"D185*Impostos!$C$15","v":0},{"$f":"D185*Impostos!$C$16","v":0},{"$f":"D185*Impostos!$C$17","v":0},{"$f":"D185*Impostos!$C$18","v":0},{"$f":"D185*Impostos!$C$19","v":0},0,0,null,null,""]
[null,null,null,null,{"$f":"D186*Impostos!$C$15","v":0},{"$f":"D186*Impostos!$C$16","v":0},{"$f":"D186*Impostos!$C$17","v":0},{"$f":"D186*Impostos!$C$18","v":0},{"$f":"D186*Impostos!$C$19","v":0},0,0,null,null,""]
[null,null,null,null,{"$f":"D187*Impostos!$C$15","v":0},{"$f":"D187*Impostos!$C$16","v":0},{"$f":"D187*Impostos!$C$17","v":0},{"$f":"D187*Impostos!$C$18","v":0},{"$f":"D187*Impostos!$C$19","v":0},0,0,null,null,""]
[null,null,null,null,{"$f":"D188*Impostos!$C$15","v":0},{"$f":"D188*Impostos!$C$16","v":0},{"$f":"D188*Impostos!$C$17","v":0},{"$f":"D188*Impostos!$C$18","v":0},{"$f":"D188*Impostos!$C$19","v":0},0,0,null,null,""]
[null,null,null,null,{"$f":"D189*Impostos!$C$15","v":0},{"$f":"D189*Impostos!$C$16","v":0},{"$f":"D189*Impostos!$C$17","v":0},{"$f":"D189*Impostos!$C$18","v":0},{"$f":"D189*Impostos!$C$19","v":0},0,0,null,null,""]
[null,null,null,null,{"$f":"D190*Impostos!$C$15","v":0},{"$f":"D190*Impostos!$C$16","v":0},{"$f":"D190*Impostos!$C$17","v":0},{"$f":"D190*Impostos!$C$18","v":0},{"$f":"D190*Impostos!$C$19","v":0},0,0,null,null,""]
[null,null,null,null,{"$f":"D191*Impostos!$C$15","v":0},{"$f":"D191*Impostos!$C$16","v":0},{"$f":"D191*Impostos!$C$17","v":0},{"$f":"D191*Impostos!$C$18","v":0},{"$f":"D191*Impostos!$C$19","v":0},0,0,null,null,""]
[null,null,null,null,{"$f":"D192*Impostos!$C$15","v":0},{"$f":"D192*Impostos!$C$16","v":0},{"$f":"D192*Impostos!$C$17","v":0},{"$f":"D192*Impostos!$C$18","v":0},{"$f":"D192*Impostos!$C$19","v":0},0,0,null,null,""]
[null,null,null,null,{"$f":"D193*Impostos!$C$15","v":0},{"$f":"D193*Impostos!$C$16","v":0},{"$f":"D193*Impostos!$C$17","v":0},{"$f":"D193*Impostos!$C$18","v":0},{"$f":"D193*Impostos!$C$19","v":0},0,0,null,null,""]
[null,null,null,null,{"$f":"D194*Impostos!$C$15","v":0},{"$f":"D194*Impostos!$C$16","v":0},{"$f":"D194*Impostos!$C$17","v":0},{"$f":"D194*Impostos!$C$18","v":0},{"$f":"D194*Impostos!$C$19","v":0},0,0,null,null,""]
[null,null,null,null,{"$f":"D195*Impostos!$C$15","v":0},{"$f":"D195*Impostos!$C$16","v":0},{"$f":"D195*Impostos!$C$17","v":0},{"$f":"D195*Impostos!$C$18","v":0},{"$f":"D195*Impostos!$C$19","v":0},0,0,null,null,""]
[null,null,null,null,{"$f":"D196*Impostos!$C$15","v":0},{"$f":"D196*Impostos!$C$16","v":0},{"$f":"D196*Impostos!$C$17","v":0},{"$f":"D196*Impostos!$C$18","v":0},{"$f":"D196*Impostos!$C$19","v":0},0,0,null,null,""]
[null,null,null,null,{"$f":"D197*Impostos!$C$15","v":0},{"$f":"D197*Impostos!$C$16","v":0},{"$f":"D197*Impostos!$C$17","v":0},{"$f":"D197*Impostos!$C$18","v":0},{"$f":"D197*Impostos!$C$19","v":0},0,0,null,null,""]
[null,null,null,null,{"$f":"D198*Impostos!$C$15","v":0},{"$f":"D198*Impostos!$C$16","v":0},{"$f":"D198*Impostos!$C$17","v":0},{"$f":"D198*Impostos!$C$18","v":0},{"$f":"D198*Impostos!$C$19","v":0},0,0,null,null,""]
[null,null,null,null,{"$f":"D199*Impostos!$C$15","v":0},{"$f":"D199*Impostos!$C$16","v":0},{"$f":"D199*Impostos!$C$17","v":0},{"$f":"D199*Impostos!$C$18","v":0},{"$f":"D199*Impostos!$C$19","v":0},0,0,null,null,""]
[null,null,null,null,{"$f":"D200*Impostos!$C$15","v":0},{"$f":"D200*Impostos!$C$16","v":0},{"$f":"D200*Impostos!$C$17","v":0},{"$f":"D200*Impostos!$C$18","v":0},{"$f":"D200*Impostos!$C$19","v":0},0,0,null,null,""]
[null,null,null,null,{"$f":"D201*Impostos!$C$15","v":0},{"$f":"D201*Impostos!$C$16","v":0},{"$f":"D201*Impostos!$C$17","v":0},{"$f":"D201*Impostos!$C$18","v":0},{"$f":"D201*Impostos!$C$19","v":0},0,0,null,null,""]
[null,null,null,null,{"$f":"D202*Impostos!$C$15","v":0},{"$f":"D202*Impostos!$C$16","v":0},{"$f":"D202*Impostos!$C$17","v":0},{"$f":"D202*Impostos!$C$18","v":0},{"$f":"D202*Impostos!$C$19","v":0},0,0,null,null,""]
[null,null,null,null,{"$f":"D203*Impostos!$C$15","v":0},{"$f":"D203*Impostos!$C$16","v":0},{"$f":"D203*Impostos!$C$17","v":0},{"$f":"D203*Impostos!$C$18","v":0},{"$f":"D203*Impostos!$C$19","v":0},0,0,null,null,""]
[null,null,null,null,{"$f":"D204*Impostos!$C$15","v":0},{"$f":"D204*Impostos!$C$16","v":0},{"$f":"D204*Impostos!$C$17","v":0},{"$f":"D204*Impostos!$C$18","v":0},{"$f":"D204*Impostos!$C$19","v":0},0,0,null,null,""]
[null,null,null,null,{"$f":"D205*Impostos!$C$15","v":0},{"$f":"D205*Impostos!$C$16","v":0},{"$f":"D205*Impostos!$C$17","v":0},{"$f":"D205*Impostos!$C$18","v":0},{"$f":"D205*Impostos!$C$19","v":0},0,0,null,null,""]
[null,null,null,null,{"$f":"D206*Impostos!$C$15","v":0},{"$f":"D206*Impostos!$C$16","v":0},{"$f":"D206*Impostos!$C$17","v":0},{"$f":"D206*Impostos!$C$18","v":0},{"$f":"D206*Impostos!$C$19","v":0},0,0,null,null,""]
[null,null,null,null,{"$f":"D207*Impostos!$C$15","v":0},{"$f":"D207*Impostos!$C$16","v":0},{"$f":"D207*Impostos!$C$17","v":0},{"$f":"D207*Impostos!$C$18","v":0},{"$f":"D207*Impostos!$C$19","v":0},0,0,null,null,""]
[null,null,null,null,{"$f":"D208*Impostos!$C$15","v":0},{"$f":"D208*Impostos!$C$16","v":0},{"$f":"D208*Impostos!$C$17","v":0},{"$f":"D208*Impostos!$C$18","v":0},{"$f":"D208*Impostos!$C$19","v":0},0,0,null,null,{"$f":"IF(C208=\"\",\"\",MONTH(C208))","v":""}]
[null,null,null,null,{"$f":"D209*Impostos!$C$15","v":0},{"$f":"D209*Impostos!$C$16","v":0},{"$f":"D209*Impostos!$C$17","v":0},{"$f":"D209*Impostos!$C$18","v":0},{"$f":"D209*Impostos!$C$19","v":0},0,0,null,null,""]
[null,null,null,null,{"$f":"D210*Impostos!$C$15","v":0},{"$f":"D210*Impostos!$C$16","v":0},{"$f":"D210*Impostos!$C$17","v":0},{"$f":"D210*Impostos!$C$18","v":0},{"$f":"D210*Impostos!$C$19","v":0},0,0,null,null,""]
[null,null,null,null,{"$f":"D211*Impostos!$C$15","v":0},{"$f":"D211*Impostos!$C$16","v":0},{"$f":"D211*Impostos!$C$17","v":0},{"$f":"D211*Impostos!$C$18","v":0},{"$f":"D211*Impostos!$C$19","v":0},0,0,null,null,""]
[null,null,null,null,{"$f":"D212*Impostos!$C$15","v":0},{"$f":"D212*Impostos!$C$16","v":0},{"$f":"D212*Impostos!$C$17","v":0},{"$f":"D212*Impostos!$C$18","v":0},{"$f":"D212*Impostos!$C$19","v":0},0,0,null,null,""]
[null,null,null,null,{"$f":"D213*Impostos!$C$15","v":0},{"$f":"D213*Impostos!$C$16","v":0},{"$f":"D213*Impostos!$C$17","v":0},{"$f":"D213*Impostos!$C$18","v":0},{"$f":"D213*Impostos!$C$19","v":0},0,0,null,null,""]
[null,null,null,null,{"$f":"D214*Impostos!$C$15","v":0},{"$f":"D214*Impostos!$C$16","v":0},{"$f":"D214*Impostos!$C$17","v":0},{"$f":"D214*Impostos!$C$18","v":0},{"$f":"D214*Impostos!$C$19","v":0},0,0,null,null,""]
[null,null,null,null,{"$f":"D215*Impostos!$C$15","v":0},{"$f":"D215*Impostos!$C$16","v":0},{"$f":"D215*Impostos!$C$17","v":0},{"$f":"D215*Impostos!$C$18","v":0},{"$f":"D215*Impostos!$C$19","v":0},0,0,null,null,""]
[null,null,null,null,{"$f":"D216*Impostos!$C$15","v":0},{"$f":"D216*Impostos!$C$16","v":0},{"$f":"D216*Impostos!$C$17","v":0},{"$f":"D216*Impostos!$C$18","v":0},{"$f":"D216*Impostos!$C$19","v":0},{"$f":"SUM(E216:I216)","v":0},{"$f":"D216-J216","v":0},null,null,""]
[null,null,null,null,{"$f":"D217*Impostos!$C$15","v":0},{"$f":"D217*Impostos!$C$16","v":0},{"$f":"D217*Impostos!$C$17","v":0},{"$f":"D217*Impostos!$C$18","v":0},{"$f":"D217*Impostos!$C$19","v":0},0,0,null,null,""]
[null,null,null,null,{"$f":"D218*Impostos!$C$15","v":0},{"$f":"D218*Impostos!$C$16","v":0},{"$f":"D218*Impostos!$C$17","v":0},{"$f":"D218*Impostos!$C$18","v":0},{"$f":"D218*Impostos!$C$19","v":0},0,0,null,null,""]
[null,null,null,null,{"$f":"D219*Impostos!$C$15","v":0},{"$f":"D219*Impostos!$C$16","v":0},{"$f":"D219*Impostos!$C$17","v":0},{"$f":"D219*Impostos!$C$18","v":0},{"$f":"D219*Impostos!$C$19","v":0},0,0,null,null,""]
[null,null,null,null,{"$f":"D220*Impostos!$C$15","v":0},{"$f":"D220*Impostos!$C$16","v":0},{"$f":"D220*Impostos!$C$17","v":0},{"$f":"D220*Impostos!$C$18","v":0},{"$f":"D220*Impostos!$C$19","v":0},0,0,null,null,""]
[null,null,null,null,{"$f":"D221*Impostos!$C$15","v":0},{"$f":"D221*Impostos!$C$16","v":0},{"$f":"D221*Impostos!$C$17","v":0},{"$f":"D221*Impostos!$C$18","v":0},{"$f":"D221*Impostos!$C$19","v":0},0,0,null,null,""]
[null,null,null,null,{"$f":"D222*Impostos!$C$15","v":0},{"$f":"D222*Impostos!$C$16","v":0},{"$f":"D222*Impostos!$C$17","v":0},{"$f":"D222*Impostos!$C$18","v":0},{"$f":"D222*Impostos!$C$19","v":0},0,0,null,null,""]
[null,null,null,null,{"$f":"D223*Impostos!$C$15","v":0},{"$f":"D223*Impostos!$C$16","v":0},{"$f":"D223*Impostos!$C$17","v":0},{"$f":"D223*Impostos!$C$18","v":0},{"$f":"D223*Impostos!$C$19","v":0},0,0,null,null,""]
[null,null,null,null,{"$f":"D224*Impostos!$C$15","v":0},{"$f":"D224*Impostos!$C$16","v":0},{"$f":"D224*Impostos!$C$17","v":0},{"$f":"D224*Impostos!$C$18","v":0},{"$f":"D224*Impostos!$C$19","v":0},0,0,null,null,""]
[null,null,null,null,{"$f":"D225*Impostos!$C$15","v":0},{"$f":"D225*Impostos!$C$16","v":0},{"$f":"D225*Impostos!$C$17","v":0},{"$f":"D225*Impostos!$C$18","v":0},{"$f":"D225*Impostos!$C$19","v":0},0,0,null,null,""]
[null,null,null,null,{"$f":"D226*Impostos!$C$15","v":0},{"$f":"D226*Impostos!$C$16","v":0},{"$f":"D226*Impostos!$C$17","v":0},{"$f":"D226*Impostos!$C$18","v":0},{"$f":"D226*Impostos!$C$19","v":0},0,0,null,null,""]
[null,null,null,null,{"$f":"D227*Impostos!$C$15","v":0},{"$f":"D227*Impostos!$C$16","v":0},{"$f":"D227*Impostos!$C$17","v":0},{"$f":"D227*Impostos!$C$18","v":0},{"$f":"D227*Impostos!$C$19","v":0},0,0,null,null,""]
[null,null,null,null,{"$f":"D228*Impostos!$C$15","v":0},{"$f":"D228*Impostos!$C$16","v":0},{"$f":"D228*Impostos!$C$17","v":0},{"$f":"D228*Impostos!$C$18","v":0},{"$f":"D228*Impostos!$C$19","v":0},0,0,null,null,""]
[null,null,null,null,{"$f":"D229*Impostos!$C$15","v":0},{"$f":"D229*Impostos!$C$16","v":0},{"$f":"D229*Impostos!$C$17","v":0},{"$f":"D229*Impostos!$C$18","v":0},{"$f":"D229*Impostos!$C$19","v":0},0,0,null,null,""]
[null,null,null,null,{"$f":"D230*Impostos!$C$15","v":0},{"$f":"D230*Impostos!$C$16","v":0},{"$f":"D230*Impostos!$C$17","v":0},{"$f":"D230*Impostos!$C$18","v":0},{"$f":"D230*Impostos!$C$19","v":0},0,0,null,null,""]
[null,null,null,null,{"$f":"D231*Impostos!$C$15","v":0},{"$f":"D231*Impostos!$C$16","v":0},{"$f":"D231*Impostos!$C$17","v":0},{"$f":"D231*Impostos!$C$18","v":0},{"$f":"D231*Impostos!$C$19","v":0},0,0,null,null,""]
[null,null,null,null,{"$f":"D232*Impostos!$C$15","v":0},{"$f":"D232*Impostos!$C$16","v":0},{"$f":"D232*Impostos!$C$17","v":0},{"$f":"D232*Impostos!$C$18","v":0},{"$f":"D232*Impostos!$C$19","v":0},0,0,null,null,""]
[null,null,null,null,{"$f":"D233*Impostos!$C$15","v":0},{"$f":"D233*Impostos!$C$16","v":0},{"$f":"D233*Impostos!$C$17","v":0},{"$f":"D233*Impostos!$C$18","v":0},{"$f":"D233*Impostos!$C$19","v":0},0,0,null,null,""]
[null,null,null,null,{"$f":"D234*Impostos!$C$15","v":0},{"$f":"D234*Impostos!$C$16","v":0},{"$f":"D234*Impostos!$C$17","v":0},{"$f":"D234*Impostos!$C$18","v":0},{"$f":"D234*Impostos!$C$19","v":0},0,0,null,null,""]
[null,null,null,null,{"$f":"D235*Impostos!$C$15","v":0},{"$f":"D235*Impostos!$C$16","v":0},{"$f":"D235*Impostos!$C$17","v":0},{"$f":"D235*Impostos!$C$18","v":0},{"$f":"D235*Impostos!$C$19","v":0},0,0,null,null,""]
[null,null,null,null,{"$f":"D236*Impostos!$C$15","v":0},{"$f":"D236*Impostos!$C$16","v":0},{"$f":"D236*Impostos!$C$17","v":0},{"$f":"D236*Impostos!$C$18","v":0},{"$f":"D236*Impostos!$C$19","v":0},0,0,null,null,""]
[null,null,null,null,{"$f":"D237*Impostos!$C$15","v":0},{"$f":"D237*Impostos!$C$16","v":0},{"$f":"D237*Impostos!$C$17","v":0},{"$f":"D237*Impostos!$C$18","v":0},{"$f":"D237*Impostos!$C$19","v":0},0,0,null,null,""]
[null,null,null,null,{"$f":"D238*Impostos!$C$15","v":0},{"$f":"D238*Impostos!$C$16","v":0},{"$f":"D238*Impostos!$C$17","v":0},{"$f":"D238*Impostos!$C$18","v":0},{"$f":"D238*Impostos!$C$19","v":0},0,0,null,null,""]
[null,null,null,null,{"$f":"D239*Impostos!$C$15","v":0},{"$f":"D239*Impostos!$C$16","v":0},{"$f":"D239*Impostos!$C$17","v":0},{"$f":"D239*Impostos!$C$18","v":0},{"$f":"D239*Impostos!$C$19","v":0},0,0,null,null,""]
[null,null,null,null,{"$f":"D240*Impostos!$C$15","v":0},{"$f":"D240*Impostos!$C$16","v":0},{"$f":"D240*Impostos!$C$17","v":0},{"$f":"D240*Impostos!$C$18","v":0},{"$f":"D240*Impostos!$C$19","v":0},0,0,null,null,""]
[null,null,null,null,{"$f":"D241*Impostos!$C$15","v":0},{"$f":"D241*Impostos!$C$16","v":0},{"$f":"D241*Impostos!$C$17","v":0},{"$f":"D241*Impostos!$C$18","v":0},{"$f":"D241*Impostos!$C$19","v":0},0,0,null,null,""]
[null,null,null,null,{"$f":"D242*Impostos!$C$15","v":0},{"$f":"D242*Impostos!$C$16","v":0},{"$f":"D242*Impostos!$C$17","v":0},{"$f":"D242*Impostos!$C$18","v":0},{"$f":"D242*Impostos!$C$19","v":0},0,0,null,null,""]
[null,null,null,null,{"$f":"D243*Impostos!$C$15","v":0},{"$f":"D243*Impostos!$C$16","v":0},{"$f":"D243*Impostos!$C$17","v":0},{"$f":"D243*Impostos!$C$18","v":0},{"$f":"D243*Impostos!$C$19","v":0},0,0,null,null,""]
[null,null,null,null,{"$f":"D244*Impostos!$C$15","v":0},{"$f":"D244*Impostos!$C$16","v":0},{"$f":"D244*Impostos!$C$17","v":0},{"$f":"D244*Impostos!$C$18","v":0},{"$f":"D244*Impostos!$C$19","v":0},0,0,null,null,""]
[null,null,null,null,{"$f":"D245*Impostos!$C$15","v":0},{"$f":"D245*Impostos!$C$16","v":0},{"$f":"D245*Impostos!$C$17","v":0},{"$f":"D245*Impostos!$C$18","v":0},{"$f":"D245*Impostos!$C$19","v":0},0,0,null,null,""]
[null,null,null,null,{"$f":"D246*Impostos!$C$15","v":0},{"$f":"D246*Impostos!$C$16","v":0},{"$f":"D246*Impostos!$C$17","v":0},{"$f":"D246*Impostos!$C$18","v":0},{"$f":"D246*Impostos!$C$19","v":0},0,0,null,null,""]
[null,null,null,null,{"$f":"D247*Impostos!$C$15","v":0},{"$f":"D247*Impostos!$C$16","v":0},{"$f":"D247*Impostos!$C$17","v":0},{"$f":"D247*Impostos!$C$18","v":0},{"$f":"D247*Impostos!$C$19","v":0},0,0,null,null,""]
[null,null,null,null,{"$f":"D248*Impostos!$C$15","v":0},{"$f":"D248*Impostos!$C$16","v":0},{"$f":"D248*Impostos!$C$17","v":0},{"$f":"D248*Impostos!$C$18","v":0},{"$f":"D248*Impostos!$C$19","v":0},0,0,null,null,""]
[null,null,null,null,{"$f":"D249*Impostos!$C$15","v":0},{"$f":"D249*Impostos!$C$16","v":0},{"$f":"D249*Impostos!$C$17","v":0},{"$f":"D249*Impostos!$C$18","v":0},{"$f":"D249*Impostos!$C$19","v":0},0,0,null,null,""]
[null,null,null,null,{"$f":"D250*Impostos!$C$15","v":0},{"$f":"D250*Impostos!$C$16","v":0},{"$f":"D250*Impostos!$C$17","v":0},{"$f":"D250*Impostos!$C$18","v":0},{"$f":"D250*Impostos!$C$19","v":0},0,0,null,null,""]
[null,null,null,null,{"$f":"D251*Impostos!$C$15","v":0},{"$f":"D251*Impostos!$C$16","v":0},{"$f":"D251*Impostos!$C$17","v":0},{"$f":"D251*Impostos!$C$18","v":0},{"$f":"D251*Impostos!$C$19","v":0},0,0,null,null,""]
[null,null,null,null,{"$f":"D252*Impostos!$C$15","v":0},{"$f":"D252*Impostos!$C$16","v":0},{"$f":"D252*Impostos!$C$17","v":0},{"$f":"D252*Impostos!$C$18","v":0},{"$f":"D252*Impostos!$C$19","v":0},0,0,null,null,""]
[null,null,null,null,{"$f":"D253*Impostos!$C$15","v":0},{"$f":"D253*Impostos!$C$16","v":0},{"$f":"D253*Impostos!$C$17","v":0},{"$f":"D253*Impostos!$C$18","v":0},{"$f":"D253*Impostos!$C$19","v":0},0,0,null,null,""]
[null,null,null,null,{"$f":"D254*Impostos!$C$15","v":0},{"$f":"D254*Impostos!$C$16","v":0},{"$f":"D254*Impostos!$C$17","v":0},{"$f":"D254*Impostos!$C$18","v":0},{"$f":"D254*Impostos!$C$19","v":0},0,0,null,null,""]
[null,null,null,null,{"$f":"D255*Impostos!$C$15","v":0},{"$f":"D255*Impostos!$C$16","v":0},{"$f":"D255*Impostos!$C$17","v":0},{"$f":"D255*Impostos!$C$18","v":0},{"$f":"D255*Impostos!$C$19","v":0},0,0,null,null,""]
[null,null,null,null,{"$f":"D256*Impostos!$C$15","v":0},{"$f":"D256*Impostos!$C$16","v":0},{"$f":"D256*Impostos!$C$17","v":0},{"$f":"D256*Impostos!$C$18","v":0},{"$f":"D256*Impostos!$C$19","v":0},0,0,null,null,""]
[null,null,null,null,{"$f":"D257*Impostos!$C$15","v":0},{"$f":"D257*Impostos!$C$16","v":0},{"$f":"D257*Impostos!$C$17","v":0},{"$f":"D257*Impostos!$C$18","v":0},{"$f":"D257*Impostos!$C$19","v":0},0,0,null,null,""]
[null,null,null,null,{"$f":"D258*Impostos!$C$15","v":0},{"$f":"D258*Impostos!$C$16","v":0},{"$f":"D258*Impostos!$C$17","v":0},{"$f":"D258*Impostos!$C$18","v":0},{"$f":"D258*Impostos!$C$19","v":0},0,0,null,null,""]
[null,null,null,null,{"$f":"D259*Impostos!$C$15","v":0},{"$f":"D259*Impostos!$C$16","v":0},{"$f":"D259*Impostos!$C$17","v":0},{"$f":"D259*Impostos!$C$18","v":0},{"$f":"D259*Impostos!$C$19","v":0},0,0,null,null,""]
[null,null,null,null,{"$f":"D260*Impostos!$C$15","v":0},{"$f":"D260*Impostos!$C$16","v":0},{"$f":"D260*Impostos!$C$17","v":0},{"$f":"D260*Impostos!$C$18","v":0},{"$f":"D260*Impostos!$C$19","v":0},0,0,null,null,""]
[null,null,null,null,{"$f":"D261*Impostos!$C$15","v":0},{"$f":"D261*Impostos!$C$16","v":0},{"$f":"D261*Impostos!$C$17","v":0},{"$f":"D261*Impostos!$C$18","v":0},{"$f":"D261*Impostos!$C$19","v":0},0,0,null,null,""]
[null,null,null,null,{"$f":"D262*Impostos!$C$15","v":0},{"$f":"D262*Impostos!$C$16","v":0},{"$f":"D262*Impostos!$C$17","v":0},{"$f":"D262*Impostos!$C$18","v":0},{"$f":"D262*Impostos!$C$19","v":0},0,0,null,null,""]
[null,null,null,null,{"$f":"D263*Impostos!$C$15","v":0},{"$f":"D263*Impostos!$C$16","v":0},{"$f":"D263*Impostos!$C$17","v":0},{"$f":"D263*Impostos!$C$18","v":0},{"$f":"D263*Impostos!$C$19","v":0},0,0,null,null,""]
[null,null,null,null,{"$f":"D264*Impostos!$C$15","v":0},{"$f":"D264*Impostos!$C$16","v":0},{"$f":"D264*Impostos!$C$17","v":0},{"$f":"D264*Impostos!$C$18","v":0},{"$f":"D264*Impostos!$C$19","v":0},0,0,null,null,""]
[null,null,null,null,{"$f":"D265*Impostos!$C$15","v":0},{"$f":"D265*Impostos!$C$16","v":0},{"$f":"D265*Impostos!$C$17","v":0},{"$f":"D265*Impostos!$C$18","v":0},{"$f":"D265*Impostos!$C$19","v":0},0,0,null,null,""]
[null,null,null,null,{"$f":"D266*Impostos!$C$15","v":0},{"$f":"D266*Impostos!$C$16","v":0},{"$f":"D266*Impostos!$C$17","v":0},{"$f":"D266*Impostos!$C$18","v":0},{"$f":"D266*Impostos!$C$19","v":0},0,0,null,null,""]
[null,null,null,null,{"$f":"D267*Impostos!$C$15","v":0},{"$f":"D267*Impostos!$C$16","v":0},{"$f":"D267*Impostos!$C$17","v":0},{"$f":"D267*Impostos!$C$18","v":0},{"$f":"D267*Impostos!$C$19","v":0},0,0,null,null,""]
[null,null,null,null,{"$f":"D268*Impostos!$C$15","v":0},{"$f":"D268*Impostos!$C$16","v":0},{"$f":"D268*Impostos!$C$17","v":0},{"$f":"D268*Impostos!$C$18","v":0},{"$f":"D268*Impostos!$C$19","v":0},0,0,null,null,""]
[null,null,null,null,{"$f":"D269*Impostos!$C$15","v":0},{"$f":"D269*Impostos!$C$16","v":0},{"$f":"D269*Impostos!$C$17","v":0},{"$f":"D269*Impostos!$C$18","v":0},{"$f":"D269*Impostos!$C$19","v":0},0,0,null,null,""]
[null,null,null,null,{"$f":"D270*Impostos!$C$15","v":0},{"$f":"D270*Impostos!$C$16","v":0},{"$f":"D270*Impostos!$C$17","v":0},{"$f":"D270*Impostos!$C$18","v":0},{"$f":"D270*Impostos!$C$19","v":0},0,0,null,null,""]
[null,null,null,null,{"$f":"D271*Impostos!$C$15","v":0},{"$f":"D271*Impostos!$C$16","v":0},{"$f":"D271*Impostos!$C$17","v":0},{"$f":"D271*Impostos!$C$18","v":0},{"$f":"D271*Impostos!$C$19","v":0},0,0,null,null,""]
[null,null,null,null,{"$f":"D272*Impostos!$C$15","v":0},{"$f":"D272*Impostos!$C$16","v":0},{"$f":"D272*Impostos!$C$17","v":0},{"$f":"D272*Impostos!$C$18","v":0},{"$f":"D272*Impostos!$C$19","v":0},0,0,null,null,{"$f":"IF(C272=\"\",\"\",MONTH(C272))","v":""}]
[null,null,null,null,{"$f":"D273*Impostos!$C$15","v":0},{"$f":"D273*Impostos!$C$16","v":0},{"$f":"D273*Impostos!$C$17","v":0},{"$f":"D273*Impostos!$C$18","v":0},{"$f":"D273*Impostos!$C$19","v":0},0,0,null,null,""]
[null,null,null,null,{"$f":"D274*Impostos!$C$15","v":0},{"$f":"D274*Impostos!$C$16","v":0},{"$f":"D274*Impostos!$C$17","v":0},{"$f":"D274*Impostos!$C$18","v":0},{"$f":"D274*Impostos!$C$19","v":0},0,0,null,null,""]
[null,null,null,null,{"$f":"D275*Impostos!$C$15","v":0},{"$f":"D275*Impostos!$C$16","v":0},{"$f":"D275*Impostos!$C$17","v":0},{"$f":"D275*Impostos!$C$18","v":0},{"$f":"D275*Impostos!$C$19","v":0},0,0,null,null,""]
[null,null,null,null,{"$f":"D276*Impostos!$C$15","v":0},{"$f":"D276*Impostos!$C$16","v":0},{"$f":"D276*Impostos!$C$17","v":0},{"$f":"D276*Impostos!$C$18","v":0},{"$f":"D276*Impostos!$C$19","v":0},0,0,null,null,""]
[null,null,null,null,{"$f":"D277*Impostos!$C$15","v":0},{"$f":"D277*Impostos!$C$16","v":0},{"$f":"D277*Impostos!$C$17","v":0},{"$f":"D277*Impostos!$C$18","v":0},{"$f":"D277*Impostos!$C$19","v":0},0,0,null,null,""]
[null,null,null,null,{"$f":"D278*Impostos!$C$15","v":0},{"$f":"D278*Impostos!$C$16","v":0},{"$f":"D278*Impostos!$C$17","v":0},{"$f":"D278*Impostos!$C$18","v":0},{"$f":"D278*Impostos!$C$19","v":0},0,0,null,null,""]
[null,null,null,null,{"$f":"D279*Impostos!$C$15","v":0},{"$f":"D279*Impostos!$C$16","v":0},{"$f":"D279*Impostos!$C$17","v":0},{"$f":"D279*Impostos!$C$18","v":0},{"$f":"D279*Impostos!$C$19","v":0},0,0,null,null,""]
[null,null,null,null,{"$f":"D280*Impostos!$C$15","v":0},{"$f":"D280*Impostos!$C$16","v":0},{"$f":"D280*Impostos!$C$17","v":0},{"$f":"D280*Impostos!$C$18","v":0},{"$f":"D280*Impostos!$C$19","v":0},{"$f":"SUM(E280:I280)","v":0},{"$f":"D280-J280","v":0},null,null,""]
[null,null,null,null,{"$f":"D281*Impostos!$C$15","v":0},{"$f":"D281*Impostos!$C$16","v":0},{"$f":"D281*Impostos!$C$17","v":0},{"$f":"D281*Impostos!$C$18","v":0},{"$f":"D281*Impostos!$C$19","v":0},0,0,null,null,""]
[null,null,null,null,{"$f":"D282*Impostos!$C$15","v":0},{"$f":"D282*Impostos!$C$16","v":0},{"$f":"D282*Impostos!$C$17","v":0},{"$f":"D282*Impostos!$C$18","v":0},{"$f":"D282*Impostos!$C$19","v":0},0,0,null,null,""]
[null,null,null,null,{"$f":"D283*Impostos!$C$15","v":0},{"$f":"D283*Impostos!$C$16","v":0},{"$f":"D283*Impostos!$C$17","v":0},{"$f":"D283*Impostos!$C$18","v":0},{"$f":"D283*Impostos!$C$19","v":0},0,0,null,null,""]
[null,null,null,null,{"$f":"D284*Impostos!$C$15","v":0},{"$f":"D284*Impostos!$C$16","v":0},{"$f":"D284*Impostos!$C$17","v":0},{"$f":"D284*Impostos!$C$18","v":0},{"$f":"D284*Impostos!$C$19","v":0},0,0,null,null,""]
[null,null,null,null,{"$f":"D285*Impostos!$C$15","v":0},{"$f":"D285*Impostos!$C$16","v":0},{"$f":"D285*Impostos!$C$17","v":0},{"$f":"D285*Impostos!$C$18","v":0},{"$f":"D285*Impostos!$C$19","v":0},0,0,null,null,""]
[null,null,null,null,{"$f":"D286*Impostos!$C$15","v":0},{"$f":"D286*Impostos!$C$16","v":0},{"$f":"D286*Impostos!$C$17","v":0},{"$f":"D286*Impostos!$C$18","v":0},{"$f":"D286*Impostos!$C$19","v":0},0,0,null,null,""]
[null,null,null,null,{"$f":"D287*Impostos!$C$15","v":0},{"$f":"D287*Impostos!$C$16","v":0},{"$f":"D287*Impostos!$C$17","v":0},{"$f":"D287*Impostos!$C$18","v":0},{"$f":"D287*Impostos!$C$19","v":0},0,0,null,null,""]
[null,null,null,null,{"$f":"D288*Impostos!$C$15","v":0},{"$f":"D288*Impostos!$C$16","v":0},{"$f":"D288*Impostos!$C$17","v":0},{"$f":"D288*Impostos!$C$18","v":0},{"$f":"D288*Impostos!$C$19","v":0},0,0,null,null,""]
[null,null,null,null,{"$f":"D289*Impostos!$C$15","v":0},{"$f":"D289*Impostos!$C$16","v":0},{"$f":"D289*Impostos!$C$17","v":0},{"$f":"D289*Impostos!$C$18","v":0},{"$f":"D289*Impostos!$C$19","v":0},0,0,null,null,""]
[null,null,null,null,{"$f":"D290*Impostos!$C$15","v":0},{"$f":"D290*Impostos!$C$16","v":0},{"$f":"D290*Impostos!$C$17","v":0},{"$f":"D290*Impostos!$C$18","v":0},{"$f":"D290*Impostos!$C$19","v":0},0,0,null,null,""]
[null,null,null,null,{"$f":"D291*Impostos!$C$15","v":0},{"$f":"D291*Impostos!$C$16","v":0},{"$f":"D291*Impostos!$C$17","v":0},{"$f":"D291*Impostos!$C$18","v":0},{"$f":"D291*Impostos!$C$19","v":0},0,0,null,null,""]
[null,null,null,null,{"$f":"D292*Impostos!$C$15","v":0},{"$f":"D292*Impostos!$C$16","v":0},{"$f":"D292*Impostos!$C$17","v":0},{"$f":"D292*Impostos!$C$18","v":0},{"$f":"D292*Impostos!$C$19","v":0},0,0,null,null,""]
[null,null,null,null,{"$f":"D293*Impostos!$C$15","v":0},{"$f":"D293*Impostos!$C$16","v":0},{"$f":"D293*Impostos!$C$17","v":0},{"$f":"D293*Impostos!$C$18","v":0},{"$f":"D293*Impostos!$C$19","v":0},0,0,null,null,""]
[null,null,null,null,{"$f":"D294*Impostos!$C$15","v":0},{"$f":"D294*Impostos!$C$16","v":0},{"$f":"D294*Impostos!$C$17","v":0},{"$f":"D294*Impostos!$C$18","v":0},{"$f":"D294*Impostos!$C$19","v":0},0,0,null,null,""]
[null,null,null,null,{"$f":"D295*Impostos!$C$15","v":0},{"$f":"D295*Impostos!$C$16","v":0},{"$f":"D295*Impostos!$C$17","v":0},{"$f":"D295*Impostos!$C$18","v":0},{"$f":"D295*Impostos!$C$19","v":0},0,0,null,null,""]
[null,null,null,null,{"$f":"D296*Impostos!$C$15","v":0},{"$f":"D296*Impostos!$C$16","v":0},{"$f":"D296*Impostos!$C$17","v":0},{"$f":"D296*Impostos!$C$18","v":0},{"$f":"D296*Impostos!$C$19","v":0},0,0,null,null,""]
[null,null,null,null,{"$f":"D297*Impostos!$C$15","v":0},{"$f":"D297*Impostos!$C$16","v":0},{"$f":"D297*Impostos!$C$17","v":0},{"$f":"D297*Impostos!$C$18","v":0},{"$f":"D297*Impostos!$C$19","v":0},0,0,null,null,""]
[null,null,null,null,{"$f":"D298*Impostos!$C$15","v":0},{"$f":"D298*Impostos!$C$16","v":0},{"$f":"D298*Impostos!$C$17","v":0},{"$f":"D298*Impostos!$C$18","v":0},{"$f":"D298*Impostos!$C$19","v":0},0,0,null,null,""]
[null,null,null,null,{"$f":"D299*Impostos!$C$15","v":0},{"$f":"D299*Impostos!$C$16","v":0},{"$f":"D299*Impostos!$C$17","v":0},{"$f":"D299*Impostos!$C$18","v":0},{"$f":"D299*Impostos!$C$19","v":0},0,0,null,null,""]
[null,null,null,null,{"$f":"D300*Impostos!$C$15","v":0},{"$f":"D300*Impostos!$C$16","v":0},{"$f":"D300*Impostos!$C$17","v":0},{"$f":"D300*Impostos!$C$18","v":0},{"$f":"D300*Impostos!$C$19","v":0},0,0,null,null,""]
[null,null,null,null,{"$f":"D301*Impostos!$C$15","v":0},{"$f":"D301*Impostos!$C$16","v":0},{"$f":"D301*Impostos!$C$17","v":0},{"$f":"D301*Impostos!$C$18","v":0},{"$f":"D301*Impostos!$C$19","v":0},0,0,null,null,""]
[null,null,null,null,{"$f":"D302*Impostos!$C$15","v":0},{"$f":"D302*Impostos!$C$16","v":0},{"$f":"D302*Impostos!$C$17","v":0},{"$f":"D302*Impostos!$C$18","v":0},{"$f":"D302*Impostos!$C$19","v":0},0,0,null,null,""]
[null,null,null,null,{"$f":"D303*Impostos!$C$15","v":0},{"$f":"D303*Impostos!$C$16","v":0},{"$f":"D303*Impostos!$C$17","v":0},{"$f":"D303*Impostos!$C$18","v":0},{"$f":"D303*Impostos!$C$19","v":0},0,0,null,null,""]
[null,null,null,null,{"$f":"D304*Impostos!$C$15","v":0},{"$f":"D304*Impostos!$C$16","v":0},{"$f":"D304*Impostos!$C$17","v":0},{"$f":"D304*Impostos!$C$18","v":0},{"$f":"D304*Impostos!$C$19","v":0},0,0,null,null,""]
[null,null,null,null,{"$f":"D305*Impostos!$C$15","v":0},{"$f":"D305*Impostos!$C$16","v":0},{"$f":"D305*Impostos!$C$17","v":0},{"$f":"D305*Impostos!$C$18","v":0},{"$f":"D305*Impostos!$C$19","v":0},0,0,null,null,""]
[null,null,null,null,{"$f":"D306*Impostos!$C$15","v":0},{"$f":"D306*Impostos!$C$16","v":0},{"$f":"D306*Impostos!$C$17","v":0},{"$f":"D306*Impostos!$C$18","v":0},{"$f":"D306*Impostos!$C$19","v":0},0,0,null,null,""]
[null,null,null,null,{"$f":"D307*Impostos!$C$15","v":0},{"$f":"D307*Impostos!$C$16","v":0},{"$f":"D307*Impostos!$C$17","v":0},{"$f":"D307*Impostos!$C$18","v":0},{"$f":"D307*Impostos!$C$19","v":0},0,0,null,null,""]
[null,null,null,null,{"$f":"D308*Impostos!$C$15","v":0},{"$f":"D308*Impostos!$C$16","v":0},{"$f":"D308*Impostos!$C$17","v":0},{"$f":"D308*Impostos!$C$18","v":0},{"$f":"D308*Impostos!$C$19","v":0},0,0,null,null,""]
[null,null,null,null,{"$f":"D309*Impostos!$C$15","v":0},{"$f":"D309*Impostos!$C$16","v":0},{"$f":"D309*Impostos!$C$17","v":0},{"$f":"D309*Impostos!$C$18","v":0},{"$f":"D309*Impostos!$C$19","v":0},0,0,null,null,""]
[null,null,null,null,{"$f":"D310*Impostos!$C$15","v":0},{"$f":"D310*Impostos!$C$16","v":0},{"$f":"D310*Impostos!$C$17","v":0},{"$f":"D310*Impostos!$C$18","v":0},{"$f":"D310*Impostos!$C$19","v":0},0,0,null,null,""]
[null,null,null,null,{"$f":"D311*Impostos!$C$15","v":0},{"$f":"D311*Impostos!$C$16","v":0},{"$f":"D311*Impostos!$C$17","v":0},{"$f":"D311*Impostos!$C$18","v":0},{"$f":"D311*Impostos!$C$19","v":0},0,0,null,null,""]
[null,null,null,null,{"$f":"D312*Impostos!$C$15","v":0},{"$f":"D312*Impostos!$C$16","v":0},{"$f":"D312*Impostos!$C$17","v":0},{"$f":"D312*Impostos!$C$18","v":0},{"$f":"D312*Impostos!$C$19","v":0},0,0,null,null,""]
[null,null,null,null,{"$f":"D313*Impostos!$C$15","v":0},{"$f":"D313*Impostos!$C$16","v":0},{"$f":"D313*Impostos!$C$17","v":0},{"$f":"D313*Impostos!$C$18","v":0},{"$f":"D313*Impostos!$C$19","v":0},0,0,null,null,""]
[null,null,null,null,{"$f":"D314*Impostos!$C$15","v":0},{"$f":"D314*Impostos!$C$16","v":0},{"$f":"D314*Impostos!$C$17","v":0},{"$f":"D314*Impostos!$C$18","v":0},{"$f":"D314*Impostos!$C$19","v":0},0,0,null,null,""]
[null,null,null,null,{"$f":"D315*Impostos!$C$15","v":0},{"$f":"D315*Impostos!$C$16","v":0},{"$f":"D315*Impostos!$C$17","v":0},{"$f":"D315*Impostos!$C$18","v":0},{"$f":"D315*Impostos!$C$19","v":0},0,0,null,null,""]
[null,null,null,null,{"$f":"D316*Impostos!$C$15","v":0},{"$f":"D316*Impostos!$C$16","v":0},{"$f":"D316*Impostos!$C$17","v":0},{"$f":"D316*Impostos!$C$18","v":0},{"$f":"D316*Impostos!$C$19","v":0},0,0,null,null,""]
[null,null,null,null,{"$f":"D317*Impostos!$C$15","v":0},{"$f":"D317*Impostos!$C$16","v":0},{"$f":"D317*Impostos!$C$17","v":0},{"$f":"D317*Impostos!$C$18","v":0},{"$f":"D317*Impostos!$C$19","v":0},0,0,null,null,""]
[null,null,null,null,{"$f":"D318*Impostos!$C$15","v":0},{"$f":"D318*Impostos!$C$16","v":0},{"$f":"D318*Impostos!$C$17","v":0},{"$f":"D318*Impostos!$C$18","v":0},{"$f":"D318*Impostos!$C$19","v":0},0,0,null,null,""]
[null,null,null,null,{"$f":"D319*Impostos!$C$15","v":0},{"$f":"D319*Impostos!$C$16","v":0},{"$f":"D319*Impostos!$C$17","v":0},{"$f":"D319*Impostos!$C$18","v":0},{"$f":"D319*Impostos!$C$19","v":0},0,0,null,null,""]
[null,null,null,null,{"$f":"D320*Impostos!$C$15","v":0},{"$f":"D320*Impostos!$C$16","v":0},{"$f":"D320*Impostos!$C$17","v":0},{"$f":"D320*Impostos!$C$18","v":0},{"$f":"D320*Impostos!$C$19","v":0},0,0,null,null,""]
[null,null,null,null,{"$f":"D321*Impostos!$C$15","v":0},{"$f":"D321*Impostos!$C$16","v":0},{"$f":"D321*Impostos!$C$17","v":0},{"$f":"D321*Impostos!$C$18","v":0},{"$f":"D321*Impostos!$C$19","v":0},0,0,null,null,""]
[null,null,null,null,{"$f":"D322*Impostos!$C$15","v":0},{"$f":"D322*Impostos!$C$16","v":0},{"$f":"D322*Impostos!$C$17","v":0},{"$f":"D322*Impostos!$C$18","v":0},{"$f":"D322*Impostos!$C$19","v":0},0,0,null,null,""]
[null,null,null,null,{"$f":"D323*Impostos!$C$15","v":0},{"$f":"D323*Impostos!$C$16","v":0},{"$f":"D323*Impostos!$C$17","v":0},{"$f":"D323*Impostos!$C$18","v":0},{"$f":"D323*Impostos!$C$19","v":0},0,0,null,null,""]
[null,null,null,null,{"$f":"D324*Impostos!$C$15","v":0},{"$f":"D324*Impostos!$C$16","v":0},{"$f":"D324*Impostos!$C$17","v":0},{"$f":"D324*Impostos!$C$18","v":0},{"$f":"D324*Impostos!$C$19","v":0},0,0,null,null,""]
[null,null,null,null,{"$f":"D325*Impostos!$C$15","v":0},{"$f":"D325*Impostos!$C$16","v":0},{"$f":"D325*Impostos!$C$17","v":0},{"$f":"D325*Impostos!$C$18","v":0},{"$f":"D325*Impostos!$C$19","v":0},0,0,null,null,""]
[null,null,null,null,{"$f":"D326*Impostos!$C$15","v":0},{"$f":"D326*Impostos!$C$16","v":0},{"$f":"D326*Impostos!$C$17","v":0},{"$f":"D326*Impostos!$C$18","v":0},{"$f":"D326*Impostos!$C$19","v":0},0,0,null,null,""]
[null,null,null,null,{"$f":"D327*Impostos!$C$15","v":0},{"$f":"D327*Impostos!$C$16","v":0},{"$f":"D327*Impostos!$C$17","v":0},{"$f":"D327*Impostos!$C$18","v":0},{"$f":"D327*Impostos!$C$19","v":0},0,0,null,null,""]
[null,null,null,null,{"$f":"D328*Impostos!$C$15","v":0},{"$f":"D328*Impostos!$C$16","v":0},{"$f":"D328*Impostos!$C$17","v":0},{"$f":"D328*Impostos!$C$18","v":0},{"$f":"D328*Impostos!$C$19","v":0},0,0,null,null,""]
[null,null,null,null,{"$f":"D329*Impostos!$C$15","v":0},{"$f":"D329*Impostos!$C$16","v":0},{"$f":"D329*Impostos!$C$17","v":0},{"$f":"D329*Impostos!$C$18","v":0},{"$f":"D329*Impostos!$C$19","v":0},0,0,null,null,""]
[null,null,null,null,{"$f":"D330*Impostos!$C$15","v":0},{"$f":"D330*Impostos!$C$16","v":0},{"$f":"D330*Impostos!$C$17","v":0},{"$f":"D330*Impostos!$C$18","v":0},{"$f":"D330*Impostos!$C$19","v":0},0,0,null,null,""]
[null,null,null,null,{"$f":"D331*Impostos!$C$15","v":0},{"$f":"D331*Impostos!$C$16","v":0},{"$f":"D331*Impostos!$C$17","v":0},{"$f":"D331*Impostos!$C$18","v":0},{"$f":"D331*Impostos!$C$19","v":0},0,0,null,null,""]
[null,null,null,null,{"$f":"D332*Impostos!$C$15","v":0},{"$f":"D332*Impostos!$C$16","v":0},{"$f":"D332*Impostos!$C$17","v":0},{"$f":"D332*Impostos!$C$18","v":0},{"$f":"D332*Impostos!$C$19","v":0},0,0,null,null,""]
[null,null,null,null,{"$f":"D333*Impostos!$C$15","v":0},{"$f":"D333*Impostos!$C$16","v":0},{"$f":"D333*Impostos!$C$17","v":0},{"$f":"D333*Impostos!$C$18","v":0},{"$f":"D333*Impostos!$C$19","v":0},0,0,null,null,""]
[null,null,null,null,{"$f":"D334*Impostos!$C$15","v":0},{"$f":"D334*Impostos!$C$16","v":0},{"$f":"D334*Impostos!$C$17","v":0},{"$f":"D334*Impostos!$C$18","v":0},{"$f":"D334*Impostos!$C$19","v":0},0,0,null,null,""]
[null,null,null,null,{"$f":"D335*Impostos!$C$15","v":0},{"$f":"D335*Impostos!$C$16","v":0},{"$f":"D335*Impostos!$C$17","v":0},{"$f":"D335*Impostos!$C$18","v":0},{"$f":"D335*Impostos!$C$19","v":0},0,0,null,null,""]
[null,null,null,null,{"$f":"D336*Impostos!$C$15","v":0},{"$f":"D336*Impostos!$C$16","v":0},{"$f":"D336*Impostos!$C$17","v":0},{"$f":"D336*Impostos!$C$18","v":0},{"$f":"D336*Impostos!$C$19","v":0},0,0,null,null,{"$f":"IF(C336=\"\",\"\",MONTH(C336))","v":""}]
[null,null,null,null,{"$f":"D337*Impostos!$C$15","v":0},{"$f":"D337*Impostos!$C$16","v":0},{"$f":"D337*Impostos!$C$17","v":0},{"$f":"D337*Impostos!$C$18","v":0},{"$f":"D337*Impostos!$C$19","v":0},0,0,null,null,""]
[null,null,null,null,{"$f":"D338*Impostos!$C$15","v":0},{"$f":"D338*Impostos!$C$16","v":0},{"$f":"D338*Impostos!$C$17","v":0},{"$f":"D338*Impostos!$C$18","v":0},{"$f":"D338*Impostos!$C$19","v":0},0,0,null,null,""]
[null,null,null,null,{"$f":"D339*Impostos!$C$15","v":0},{"$f":"D339*Impostos!$C$16","v":0},{"$f":"D339*Impostos!$C$17","v":0},{"$f":"D339*Impostos!$C$18","v":0},{"$f":"D339*Impostos!$C$19","v":0},0,0,null,null,""]
[null,null,null,null,{"$f":"D340*Impostos!$C$15","v":0},{"$f":"D340*Impostos!$C$16","v":0},{"$f":"D340*Impostos!$C$17","v":0},{"$f":"D340*Impostos!$C$18","v":0},{"$f":"D340*Impostos!$C$19","v":0},0,0,null,null,""]
[null,null,null,null,{"$f":"D341*Impostos!$C$15","v":0},{"$f":"D341*Impostos!$C$16","v":0},{"$f":"D341*Impostos!$C$17","v":0},{"$f":"D341*Impostos!$C$18","v":0},{"$f":"D341*Impostos!$C$19","v":0},0,0,null,null,""]
[null,null,null,null,{"$f":"D342*Impostos!$C$15","v":0},{"$f":"D342*Impostos!$C$16","v":0},{"$f":"D342*Impostos!$C$17","v":0},{"$f":"D342*Impostos!$C$18","v":0},{"$f":"D342*Impostos!$C$19","v":0},0,0,null,null,""]
[null,null,null,null,{"$f":"D343*Impostos!$C$15","v":0},{"$f":"D343*Impostos!$C$16","v":0},{"$f":"D343*Impostos!$C$17","v":0},{"$f":"D343*Impostos!$C$18","v":0},{"$f":"D343*Impostos!$C$19","v":0},0,0,null,null,""]
[null,null,null,null,{"$f":"D344*Impostos!$C$15","v":0},{"$f":"D344*Impostos!$C$16","v":0},{"$f":"D344*Impostos!$C$17","v":0},{"$f":"D344*Impostos!$C$18","v":0},{"$f":"D344*Impostos!$C$19","v":0},{"$f":"SUM(E344:I344)","v":0},{"$f":"D344-J344","v":0},null,null,""]
[null,null,null,null,{"$f":"D345*Impostos!$C$15","v":0},{"$f":"D345*Impostos!$C$16","v":0},{"$f":"D345*Impostos!$C$17","v":0},{"$f":"D345*Impostos!$C$18","v":0},{"$f":"D345*Impostos!$C$19","v":0},0,0,null,null,""]
[null,null,null,null,{"$f":"D346*Impostos!$C$15","v":0},{"$f":"D346*Impostos!$C$16","v":0},{"$f":"D346*Impostos!$C$17","v":0},{"$f":"D346*Impostos!$C$18","v":0},{"$f":"D346*Impostos!$C$19","v":0},0,0,null,null,""]
[null,null,null,null,{"$f":"D347*Impostos!$C$15","v":0},{"$f":"D347*Impostos!$C$16","v":0},{"$f":"D347*Impostos!$C$17","v":0},{"$f":"D347*Impostos!$C$18","v":0},{"$f":"D347*Impostos!$C$19","v":0},0,0,null,null,""]
[null,null,null,null,{"$f":"D348*Impostos!$C$15","v":0},{"$f":"D348*Impostos!$C$16","v":0},{"$f":"D348*Impostos!$C$17","v":0},{"$f":"D348*Impostos!$C$18","v":0},{"$f":"D348*Impostos!$C$19","v":0},0,0,null,null,""]
[null,null,null,null,{"$f":"D349*Impostos!$C$15","v":0},{"$f":"D349*Impostos!$C$16","v":0},{"$f":"D349*Impostos!$C$17","v":0},{"$f":"D349*Impostos!$C$18","v":0},{"$f":"D349*Impostos!$C$19","v":0},0,0,null,null,""]
[null,null,null,null,{"$f":"D350*Impostos!$C$15","v":0},{"$f":"D350*Impostos!$C$16","v":0},{"$f":"D350*Impostos!$C$17","v":0},{"$f":"D350*Impostos!$C$18","v":0},{"$f":"D350*Impostos!$C$19","v":0},0,0,null,null,""]
[null,null,null,null,{"$f":"D351*Impostos!$C$15","v":0},{"$f":"D351*Impostos!$C$16","v":0},{"$f":"D351*Impostos!$C$17","v":0},{"$f":"D351*Impostos!$C$18","v":0},{"$f":"D351*Impostos!$C$19","v":0},0,0,null,null,""]
[null,null,null,null,{"$f":"D352*Impostos!$C$15","v":0},{"$f":"D352*Impostos!$C$16","v":0},{"$f":"D352*Impostos!$C$17","v":0},{"$f":"D352*Impostos!$C$18","v":0},{"$f":"D352*Impostos!$C$19","v":0},0,0,null,null,""]
[null,null,null,null,{"$f":"D353*Impostos!$C$15","v":0},{"$f":"D353*Impostos!$C$16","v":0},{"$f":"D353*Impostos!$C$17","v":0},{"$f":"D353*Impostos!$C$18","v":0},{"$f":"D353*Impostos!$C$19","v":0},0,0,null,null,""]
[null,null,null,null,{"$f":"D354*Impostos!$C$15","v":0},{"$f":"D354*Impostos!$C$16","v":0},{"$f":"D354*Impostos!$C$17","v":0},{"$f":"D354*Impostos!$C$18","v":0},{"$f":"D354*Impostos!$C$19","v":0},0,0,null,null,""]
[null,null,null,null,{"$f":"D355*Impostos!$C$15","v":0},{"$f":"D355*Impostos!$C$16","v":0},{"$f":"D355*Impostos!$C$17","v":0},{"$f":"D355*Impostos!$C$18","v":0},{"$f":"D355*Impostos!$C$19","v":0},0,0,null,null,""]
[null,null,null,null,{"$f":"D356*Impostos!$C$15","v":0},{"$f":"D356*Impostos!$C$16","v":0},{"$f":"D356*Impostos!$C$17","v":0},{"$f":"D356*Impostos!$C$18","v":0},{"$f":"D356*Impostos!$C$19","v":0},0,0,null,null,""]
[null,null,null,null,{"$f":"D357*Impostos!$C$15","v":0},{"$f":"D357*Impostos!$C$16","v":0},{"$f":"D357*Impostos!$C$17","v":0},{"$f":"D357*Impostos!$C$18","v":0},{"$f":"D357*Impostos!$C$19","v":0},0,0,null,null,""]
[null,null,null,null,{"$f":"D358*Impostos!$C$15","v":0},{"$f":"D358*Impostos!$C$16","v":0},{"$f":"D358*Impostos!$C$17","v":0},{"$f":"D358*Impostos!$C$18","v":0},{"$f":"D358*Impostos!$C$19","v":0},0,0,null,null,""]
[null,null,null,null,{"$f":"D359*Impostos!$C$15","v":0},{"$f":"D359*Impostos!$C$16","v":0},{"$f":"D359*Impostos!$C$17","v":0},{"$f":"D359*Impostos!$C$18","v":0},{"$f":"D359*Impostos!$C$19","v":0},0,0,null,null,""]
[null,null,null,null,{"$f":"D360*Impostos!$C$15","v":0},{"$f":"D360*Impostos!$C$16","v":0},{"$f":"D360*Impostos!$C$17","v":0},{"$f":"D360*Impostos!$C$18","v":0},{"$f":"D360*Impostos!$C$19","v":0},0,0,null,null,""]
[null,null,null,null,{"$f":"D361*Impostos!$C$15","v":0},{"$f":"D361*Impostos!$C$16","v":0},{"$f":"D361*Impostos!$C$17","v":0},{"$f":"D361*Impostos!$C$18","v":0},{"$f":"D361*Impostos!$C$19","v":0},0,0,null,null,""]
[null,null,null,null,{"$f":"D362*Impostos!$C$15","v":0},{"$f":"D362*Impostos!$C$16","v":0},{"$f":"D362*Impostos!$C$17","v":0},{"$f":"D362*Impostos!$C$18","v":0},{"$f":"D362*Impostos!$C$19","v":0},0,0,null,null,""]
[null,null,null,null,{"$f":"D363*Impostos!$C$15","v":0},{"$f":"D363*Impostos!$C$16","v":0},{"$f":"D363*Impostos!$C$17","v":0},{"$f":"D363*Impostos!$C$18","v":0},{"$f":"D363*Impostos!$C$19","v":0},0,0,null,null,""]
[null,null,null,null,{"$f":"D364*Impostos!$C$15","v":0},{"$f":"D364*Impostos!$C$16","v":0},{"$f":"D364*Impostos!$C$17","v":0},{"$f":"D364*Impostos!$C$18","v":0},{"$f":"D364*Impostos!$C$19","v":0},0,0,null,null,""]
[null,null,null,null,{"$f":"D365*Impostos!$C$15","v":0},{"$f":"D365*Impostos!$C$16","v":0},{"$f":"D365*Impostos!$C$17","v":0},{"$f":"D365*Impostos!$C$18","v":0},{"$f":"D365*Impostos!$C$19","v":0},0,0,null,null,""]
[null,null,null,null,{"$f":"D366*Impostos!$C$15","v":0},{"$f":"D366*Impostos!$C$16","v":0},{"$f":"D366*Impostos!$C$17","v":0},{"$f":"D366*Impostos!$C$18","v":0},{"$f":"D366*Impostos!$C$19","v":0},0,0,null,null,""]
[null,null,null,null,{"$f":"D367*Impostos!$C$15","v":0},{"$f":"D367*Impostos!$C$16","v":0},{"$f":"D367*Impostos!$C$17","v":0},{"$f":"D367*Impostos!$C$18","v":0},{"$f":"D367*Impostos!$C$19","v":0},0,0,null,null,""]
[null,null,null,null,{"$f":"D368*Impostos!$C$15","v":0},{"$f":"D368*Impostos!$C$16","v":0},{"$f":"D368*Impostos!$C$17","v":0},{"$f":"D368*Impostos!$C$18","v":0},{"$f":"D368*Impostos!$C$19","v":0},0,0,null,null,""]
[null,null,null,null,{"$f":"D369*Impostos!$C$15","v":0},{"$f":"D369*Impostos!$C$16","v":0},{"$f":"D369*Impostos!$C$17","v":0},{"$f":"D369*Impostos!$C$18","v":0},{"$f":"D369*Impostos!$C$19","v":0},0,0,null,null,""]
[null,null,null,null,{"$f":"D370*Impostos!$C$15","v":0},{"$f":"D370*Impostos!$C$16","v":0},{"$f":"D370*Impostos!$C$17","v":0},{"$f":"D370*Impostos!$C$18","v":0},{"$f":"D370*Impostos!$C$19","v":0},0,0,null,null,""]
[null,null,null,null,{"$f":"D371*Impostos!$C$15","v":0},{"$f":"D371*Impostos!$C$16","v":0},{"$f":"D371*Impostos!$C$17","v":0},{"$f":"D371*Impostos!$C$18","v":0},{"$f":"D371*Impostos!$C$19","v":0},0,0,null,null,""]
[null,null,null,null,{"$f":"D372*Impostos!$C$15","v":0},{"$f":"D372*Impostos!$C$16","v":0},{"$f":"D372*Impostos!$C$17","v":0},{"$f":"D372*Impostos!$C$18","v":0},{"$f":"D372*Impostos!$C$19","v":0},0,0,null,null,""]
[null,null,null,null,{"$f":"D373*Impostos!$C$15","v":0},{"$f":"D373*Impostos!$C$16","v":0},{"$f":"D373*Impostos!$C$17","v":0},{"$f":"D373*Impostos!$C$18","v":0},{"$f":"D373*Impostos!$C$19","v":0},0,0,null,null,""]
[null,null,null,null,{"$f":"D374*Impostos!$C$15","v":0},{"$f":"D374*Impostos!$C$16","v":0},{"$f":"D374*Impostos!$C$17","v":0},{"$f":"D374*Impostos!$C$18","v":0},{"$f":"D374*Impostos!$C$19","v":0},0,0,null,null,""]
[null,null,null,null,{"$f":"D375*Impostos!$C$15","v":0},{"$f":"D375*Impostos!$C$16","v":0},{"$f":"D375*Impostos!$C$17","v":0},{"$f":"D375*Impostos!$C$18","v":0},{"$f":"D375*Impostos!$C$19","v":0},0,0,null,null,""]
[null,null,null,null,{"$f":"D376*Impostos!$C$15","v":0},{"$f":"D376*Impostos!$C$16","v":0},{"$f":"D376*Impostos!$C$17","v":0},{"$f":"D376*Impostos!$C$18","v":0},{"$f":"D376*Impostos!$C$19","v":0},0,0,null,null,""]
[null,null,null,null,{"$f":"D377*Impostos!$C$15","v":0},{"$f":"D377*Impostos!$C$16","v":0},{"$f":"D377*Impostos!$C$17","v":0},{"$f":"D377*Impostos!$C$18","v":0},{"$f":"D377*Impostos!$C$19","v":0},0,0,null,null,""]
[null,null,null,null,{"$f":"D378*Impostos!$C$15","v":0},{"$f":"D378*Impostos!$C$16","v":0},{"$f":"D378*Impostos!$C$17","v":0},{"$f":"D378*Impostos!$C$18","v":0},{"$f":"D378*Impostos!$C$19","v":0},0,0,null,null,""]
[null,null,null,null,{"$f":"D379*Impostos!$C$15","v":0},{"$f":"D379*Impostos!$C$16","v":0},{"$f":"D379*Impostos!$C$17","v":0},{"$f":"D379*Impostos!$C$18","v":0},{"$f":"D379*Impostos!$C$19","v":0},0,0,null,null,""]
[null,null,null,null,{"$f":"D380*Impostos!$C$15","v":0},{"$f":"D380*Impostos!$C$16","v":0},{"$f":"D380*Impostos!$C$17","v":0},{"$f":"D380*Impostos!$C$18","v":0},{"$f":"D380*Impostos!$C$19","v":0},0,0,null,null,""]
[null,null,null,null,{"$f":"D381*Impostos!$C$15","v":0},{"$f":"D381*Impostos!$C$16","v":0},{"$f":"D381*Impostos!$C$17","v":0},{"$f":"D381*Impostos!$C$18","v":0},{"$f":"D381*Impostos!$C$19","v":0},0,0,null,null,""]
[null,null,null,null,{"$f":"D382*Impostos!$C$15","v":0},{"$f":"D382*Impostos!$C$16","v":0},{"$f":"D382*Impostos!$C$17","v":0},{"$f":"D382*Impostos!$C$18","v":0},{"$f":"D382*Impostos!$C$19","v":0},0,0,null,null,""]
[null,null,null,null,{"$f":"D383*Impostos!$C$15","v":0},{"$f":"D383*Impostos!$C$16","v":0},{"$f":"D383*Impostos!$C$17","v":0},{"$f":"D383*Impostos!$C$18","v":0},{"$f":"D383*Impostos!$C$19","v":0},0,0,null,null,""]
[null,null,null,null,{"$f":"D384*Impostos!$C$15","v":0},{"$f":"D384*Impostos!$C$16","v":0},{"$f":"D384*Impostos!$C$17","v":0},{"$f":"D384*Impostos!$C$18","v":0},{"$f":"D384*Impostos!$C$19","v":0},0,0,null,null,""]
[null,null,null,null,{"$f":"D385*Impostos!$C$15","v":0},{"$f":"D385*Impostos!$C$16","v":0},{"$f":"D385*Impostos!$C$17","v":0},{"$f":"D385*Impostos!$C$18","v":0},{"$f":"D385*Impostos!$C$19","v":0},0,0,null,null,""]
[null,null,null,null,{"$f":"D386*Impostos!$C$15","v":0},{"$f":"D386*Impostos!$C$16","v":0},{"$f":"D386*Impostos!$C$17","v":0},{"$f":"D386*Impostos!$C$18","v":0},{"$f":"D386*Impostos!$C$19","v":0},0,0,null,null,""]
[null,null,null,null,{"$f":"D387*Impostos!$C$15","v":0},{"$f":"D387*Impostos!$C$16","v":0},{"$f":"D387*Impostos!$C$17","v":0},{"$f":"D387*Impostos!$C$18","v":0},{"$f":"D387*Impostos!$C$19","v":0},0,0,null,null,""]
[null,null,null,null,{"$f":"D388*Impostos!$C$15","v":0},{"$f":"D388*Impostos!$C$16","v":0},{"$f":"D388*Impostos!$C$17","v":0},{"$f":"D388*Impostos!$C$18","v":0},{"$f":"D388*Impostos!$C$19","v":0},0,0,null,null,""]
[null,null,null,null,{"$f":"D389*Impostos!$C$15","v":0},{"$f":"D389*Impostos!$C$16","v":0},{"$f":"D389*Impostos!$C$17","v":0},{"$f":"D389*Impostos!$C$18","v":0},{"$f":"D389*Impostos!$C$19","v":0},0,0,null,null,""]
[null,null,null,null,{"$f":"D390*Impostos!$C$15","v":0},{"$f":"D390*Impostos!$C$16","v":0},{"$f":"D390*Impostos!$C$17","v":0},{"$f":"D390*Impostos!$C$18","v":0},{"$f":"D390*Impostos!$C$19","v":0},0,0,null,null,""]
[null,null,null,null,{"$f":"D391*Impostos!$C$15","v":0},{"$f":"D391*Impostos!$C$16","v":0},{"$f":"D391*Impostos!$C$17","v":0},{"$f":"D391*Impostos!$C$18","v":0},{"$f":"D391*Impostos!$C$19","v":0},0,0,null,null,""]
[null,null,null,null,{"$f":"D392*Impostos!$C$15","v":0},{"$f":"D392*Impostos!$C$16","v":0},{"$f":"D392*Impostos!$C$17","v":0},{"$f":"D392*Impostos!$C$18","v":0},{"$f":"D392*Impostos!$C$19","v":0},0,0,null,null,""]
[null,null,null,null,{"$f":"D393*Impostos!$C$15","v":0},{"$f":"D393*Impostos!$C$16","v":0},{"$f":"D393*Impostos!$C$17","v":0},{"$f":"D393*Impostos!$C$18","v":0},{"$f":"D393*Impostos!$C$19","v":0},0,0,null,null,""]
[null,null,null,null,{"$f":"D394*Impostos!$C$15","v":0},{"$f":"D394*Impostos!$C$16","v":0},{"$f":"D394*Impostos!$C$17","v":0},{"$f":"D394*Impostos!$C$18","v":0},{"$f":"D394*Impostos!$C$19","v":0},0,0,null,null,""]
[null,null,null,null,{"$f":"D395*Impostos!$C$15","v":0},{"$f":"D395*Impostos!$C$16","v":0},{"$f":"D395*Impostos!$C$17","v":0},{"$f":"D395*Impostos!$C$18","v":0},{"$f":"D395*Impostos!$C$19","v":0},0,0,null,null,""]
[null,null,null,null,{"$f":"D396*Impostos!$C$15","v":0},{"$f":"D396*Impostos!$C$16","v":0},{"$f":"D396*Impostos!$C$17","v":0},{"$f":"D396*Impostos!$C$18","v":0},{"$f":"D396*Impostos!$C$19","v":0},0,0,null,null,""]
[null,null,null,null,{"$f":"D397*Impostos!$C$15","v":0},{"$f":"D397*Impostos!$C$16","v":0},{"$f":"D397*Impostos!$C$17","v":0},{"$f":"D397*Impostos!$C$18","v":0},{"$f":"D397*Impostos!$C$19","v":0},0,0,null,null,""]
[null,null,null,null,{"$f":"D398*Impostos!$C$15","v":0},{"$f":"D398*Impostos!$C$16","v":0},{"$f":"D398*Impostos!$C$17","v":0},{"$f":"D398*Impostos!$C$18","v":0},{"$f":"D398*Impostos!$C$19","v":0},0,0,null,null,""]
[null,null,null,null,{"$f":"D399*Impostos!$C$15","v":0},{"$f":"D399*Impostos!$C$16","v":0},{"$f":"D399*Impostos!$C$17","v":0},{"$f":"D399*Impostos!$C$18","v":0},{"$f":"D399*Impostos!$C$19","v":0},0,0,null,null,""]
[null,null,null,null,{"$f":"D400*Impostos!$C$15","v":0},{"$f":"D400*Impostos!$C$16","v":0},{"$f":"D400*Impostos!$C$17","v":0},{"$f":"D400*Impostos!$C$18","v":0},{"$f":"D400*Impostos!$C$19","v":0},0,0,null,null,{"$f":"IF(C400=\"\",\"\",MONTH(C400))","v":""}]
[null,null,null,null,{"$f":"D401*Impostos!$C$15","v":0},{"$f":"D401*Impostos!$C$16","v":0},{"$f":"D401*Impostos!$C$17","v":0},{"$f":"D401*Impostos!$C$18","v":0},{"$f":"D401*Impostos!$C$19","v":0},0,0,null,null,""]
[null,null,null,null,{"$f":"D402*Impostos!$C$15","v":0},{"$f":"D402*Impostos!$C$16","v":0},{"$f":"D402*Impostos!$C$17","v":0},{"$f":"D402*Impostos!$C$18","v":0},{"$f":"D402*Impostos!$C$19","v":0},0,0,null,null,""]
[null,null,null,null,{"$f":"D403*Impostos!$C$15","v":0},{"$f":"D403*Impostos!$C$16","v":0},{"$f":"D403*Impostos!$C$17","v":0},{"$f":"D403*Impostos!$C$18","v":0},{"$f":"D403*Impostos!$C$19","v":0},0,0,null,null,""]
[null,null,null,null,{"$f":"D404*Impostos!$C$15","v":0},{"$f":"D404*Impostos!$C$16","v":0},{"$f":"D404*Impostos!$C$17","v":0},{"$f":"D404*Impostos!$C$18","v":0},{"$f":"D404*Impostos!$C$19","v":0},0,0,null,null,""]
[null,null,null,null,{"$f":"D405*Impostos!$C$15","v":0},{"$f":"D405*Impostos!$C$16","v":0},{"$f":"D405*Impostos!$C$17","v":0},{"$f":"D405*Impostos!$C$18","v":0},{"$f":"D405*Impostos!$C$19","v":0},0,0,null,null,""]
[null,null,null,null,{"$f":"D406*Impostos!$C$15","v":0},{"$f":"D406*Impostos!$C$16","v":0},{"$f":"D406*Impostos!$C$17","v":0},{"$f":"D406*Impostos!$C$18","v":0},{"$f":"D406*Impostos!$C$19","v":0},0,0,null,null,""]
[null,null,null,null,{"$f":"D407*Impostos!$C$15","v":0},{"$f":"D407*Impostos!$C$16","v":0},{"$f":"D407*Impostos!$C$17","v":0},{"$f":"D407*Impostos!$C$18","v":0},{"$f":"D407*Impostos!$C$19","v":0},0,0,null,null,""]
[null,null,null,null,{"$f":"D408*Impostos!$C$15","v":0},{"$f":"D408*Impostos!$C$16","v":0},{"$f":"D408*Impostos!$C$17","v":0},{"$f":"D408*Impostos!$C$18","v":0},{"$f":"D408*Impostos!$C$19","v":0},{"$f":"SUM(E408:I408)","v":0},{"$f":"D408-J408","v":0},null,null,""]
[null,null,null,null,{"$f":"D409*Impostos!$C$15","v":0},{"$f":"D409*Impostos!$C$16","v":0},{"$f":"D409*Impostos!$C$17","v":0},{"$f":"D409*Impostos!$C$18","v":0},{"$f":"D409*Impostos!$C$19","v":0},0,0,null,null,""]
[null,null,null,null,{"$f":"D410*Impostos!$C$15","v":0},{"$f":"D410*Impostos!$C$16","v":0},{"$f":"D410*Impostos!$C$17","v":0},{"$f":"D410*Impostos!$C$18","v":0},{"$f":"D410*Impostos!$C$19","v":0},0,0,null,null,""]
[null,null,null,null,{"$f":"D411*Impostos!$C$15","v":0},{"$f":"D411*Impostos!$C$16","v":0},{"$f":"D411*Impostos!$C$17","v":0},{"$f":"D411*Impostos!$C$18","v":0},{"$f":"D411*Impostos!$C$19","v":0},0,0,null,null,""]
[null,null,null,null,{"$f":"D412*Impostos!$C$15","v":0},{"$f":"D412*Impostos!$C$16","v":0},{"$f":"D412*Impostos!$C$17","v":0},{"$f":"D412*Impostos!$C$18","v":0},{"$f":"D412*Impostos!$C$19","v":0},0,0,null,null,""]
[null,null,null,null,{"$f":"D413*Impostos!$C$15","v":0},{"$f":"D413*Impostos!$C$16","v":0},{"$f":"D413*Impostos!$C$17","v":0},{"$f":"D413*Impostos!$C$18","v":0},{"$f":"D413*Impostos!$C$19","v":0},0,0,null,null,""]
[null,null,null,null,{"$f":"D414*Impostos!$C$15","v":0},{"$f":"D414*Impostos!$C$16","v":0},{"$f":"D414*Impostos!$C$17","v":0},{"$f":"D414*Impostos!$C$18","v":0},{"$f":"D414*Impostos!$C$19","v":0},0,0,null,null,""]
[null,null,null,null,{"$f":"D415*Impostos!$C$15","v":0},{"$f":"D415*Impostos!$C$16","v":0},{"$f":"D415*Impostos!$C$17","v":0},{"$f":"D415*Impostos!$C$18","v":0},{"$f":"D415*Impostos!$C$19","v":0},0,0,null,null,""]
[null,null,null,null,{"$f":"D416*Impostos!$C$15","v":0},{"$f":"D416*Impostos!$C$16","v":0},{"$f":"D416*Impostos!$C$17","v":0},{"$f":"D416*Impostos!$C$18","v":0},{"$f":"D416*Impostos!$C$19","v":0},0,0,null,null,""]
[null,null,null,null,{"$f":"D417*Impostos!$C$15","v":0},{"$f":"D417*Impostos!$C$16","v":0},{"$f":"D417*Impostos!$C$17","v":0},{"$f":"D417*Impostos!$C$18","v":0},{"$f":"D417*Impostos!$C$19","v":0},0,0,null,null,""]
[null,null,null,null,{"$f":"D418*Impostos!$C$15","v":0},{"$f":"D418*Impostos!$C$16","v":0},{"$f":"D418*Impostos!$C$17","v":0},{"$f":"D418*Impostos!$C$18","v":0},{"$f":"D418*Impostos!$C$19","v":0},0,0,null,null,""]
[null,null,null,null,{"$f":"D419*Impostos!$C$15","v":0},{"$f":"D419*Impostos!$C$16","v":0},{"$f":"D419*Impostos!$C$17","v":0},{"$f":"D419*Impostos!$C$18","v":0},{"$f":"D419*Impostos!$C$19","v":0},0,0,null,null,""]
[null,null,null,null,{"$f":"D420*Impostos!$C$15","v":0},{"$f":"D420*Impostos!$C$16","v":0},{"$f":"D420*Impostos!$C$17","v":0},{"$f":"D420*Impostos!$C$18","v":0},{"$f":"D420*Impostos!$C$19","v":0},0,0,null,null,""]
[null,null,null,null,{"$f":"D421*Impostos!$C$15","v":0},{"$f":"D421*Impostos!$C$16","v":0},{"$f":"D421*Impostos!$C$17","v":0},{"$f":"D421*Impostos!$C$18","v":0},{"$f":"D421*Impostos!$C$19","v":0},0,0,null,null,""]
[null,null,null,null,{"$f":"D422*Impostos!$C$15","v":0},{"$f":"D422*Impostos!$C$16","v":0},{"$f":"D422*Impostos!$C$17","v":0},{"$f":"D422*Impostos!$C$18","v":0},{"$f":"D422*Impostos!$C$19","v":0},0,0,null,null,""]
[null,null,null,null,{"$f":"D423*Impostos!$C$15","v":0},{"$f":"D423*Impostos!$C$16","v":0},{"$f":"D423*Impostos!$C$17","v":0},{"$f":"D423*Impostos!$C$18","v":0},{"$f":"D423*Impostos!$C$19","v":0},0,0,null,null,""]
[null,null,null,null,{"$f":"D424*Impostos!$C$15","v":0},{"$f":"D424*Impostos!$C$16","v":0},{"$f":"D424*Impostos!$C$17","v":0},{"$f":"D424*Impostos!$C$18","v":0},{"$f":"D424*Impostos!$C$19","v":0},0,0,null,null,""]
[null,null,null,null,{"$f":"D425*Impostos!$C$15","v":0},{"$f":"D425*Impostos!$C$16","v":0},{"$f":"D425*Impostos!$C$17","v":0},{"$f":"D425*Impostos!$C$18","v":0},{"$f":"D425*Impostos!$C$19","v":0},0,0,null,null,""]
[null,null,null,null,{"$f":"D426*Impostos!$C$15","v":0},{"$f":"D426*Impostos!$C$16","v":0},{"$f":"D426*Impostos!$C$17","v":0},{"$f":"D426*Impostos!$C$18","v":0},{"$f":"D426*Impostos!$C$19","v":0},0,0,null,null,""]
[null,null,null,null,{"$f":"D427*Impostos!$C$15","v":0},{"$f":"D427*Impostos!$C$16","v":0},{"$f":"D427*Impostos!$C$17","v":0},{"$f":"D427*Impostos!$C$18","v":0},{"$f":"D427*Impostos!$C$19","v":0},0,0,null,null,""]
[null,null,null,null,{"$f":"D428*Impostos!$C$15","v":0},{"$f":"D428*Impostos!$C$16","v":0},{"$f":"D428*Impostos!$C$17","v":0},{"$f":"D428*Impostos!$C$18","v":0},{"$f":"D428*Impostos!$C$19","v":0},0,0,null,null,""]
[null,null,null,null,{"$f":"D429*Impostos!$C$15","v":0},{"$f":"D429*Impostos!$C$16","v":0},{"$f":"D429*Impostos!$C$17","v":0},{"$f":"D429*Impostos!$C$18","v":0},{"$f":"D429*Impostos!$C$19","v":0},0,0,null,null,""]
[null,null,null,null,{"$f":"D430*Impostos!$C$15","v":0},{"$f":"D430*Impostos!$C$16","v":0},{"$f":"D430*Impostos!$C$17","v":0},{"$f":"D430*Impostos!$C$18","v":0},{"$f":"D430*Impostos!$C$19","v":0},0,0,null,null,""]
[null,null,null,null,{"$f":"D431*Impostos!$C$15","v":0},{"$f":"D431*Impostos!$C$16","v":0},{"$f":"D431*Impostos!$C$17","v":0},{"$f":"D431*Impostos!$C$18","v":0},{"$f":"D431*Impostos!$C$19","v":0},0,0,null,null,""]
[null,null,null,null,{"$f":"D432*Impostos!$C$15","v":0},{"$f":"D432*Impostos!$C$16","v":0},{"$f":"D432*Impostos!$C$17","v":0},{"$f":"D432*Impostos!$C$18","v":0},{"$f":"D432*Impostos!$C$19","v":0},0,0,null,null,""]
[null,null,null,null,{"$f":"D433*Impostos!$C$15","v":0},{"$f":"D433*Impostos!$C$16","v":0},{"$f":"D433*Impostos!$C$17","v":0},{"$f":"D433*Impostos!$C$18","v":0},{"$f":"D433*Impostos!$C$19","v":0},0,0,null,null,""]
[null,null,null,null,{"$f":"D434*Impostos!$C$15","v":0},{"$f":"D434*Impostos!$C$16","v":0},{"$f":"D434*Impostos!$C$17","v":0},{"$f":"D434*Impostos!$C$18","v":0},{"$f":"D434*Impostos!$C$19","v":0},0,0,null,null,""]
[null,null,null,null,{"$f":"D435*Impostos!$C$15","v":0},{"$f":"D435*Impostos!$C$16","v":0},{"$f":"D435*Impostos!$C$17","v":0},{"$f":"D435*Impostos!$C$18","v":0},{"$f":"D435*Impostos!$C$19","v":0},0,0,null,null,""]
[null,null,null,null,{"$f":"D436*Impostos!$C$15","v":0},{"$f":"D436*Impostos!$C$16","v":0},{"$f":"D436*Impostos!$C$17","v":0},{"$f":"D436*Impostos!$C$18","v":0},{"$f":"D436*Impostos!$C$19","v":0},0,0,null,null,""]
[null,null,null,null,{"$f":"D437*Impostos!$C$15","v":0},{"$f":"D437*Impostos!$C$16","v":0},{"$f":"D437*Impostos!$C$17","v":0},{"$f":"D437*Impostos!$C$18","v":0},{"$f":"D437*Impostos!$C$19","v":0},0,0,null,null,""]
[null,null,null,null,{"$f":"D438*Impostos!$C$15","v":0},{"$f":"D438*Impostos!$C$16","v":0},{"$f":"D438*Impostos!$C$17","v":0},{"$f":"D438*Impostos!$C$18","v":0},{"$f":"D438*Impostos!$C$19","v":0},0,0,null,null,""]
[null,null,null,null,{"$f":"D439*Impostos!$C$15","v":0},{"$f":"D439*Impostos!$C$16","v":0},{"$f":"D439*Impostos!$C$17","v":0},{"$f":"D439*Impostos!$C$18","v":0},{"$f":"D439*Impostos!$C$19","v":0},0,0,null,null,""]
[null,null,null,null,{"$f":"D440*Impostos!$C$15","v":0},{"$f":"D440*Impostos!$C$16","v":0},{"$f":"D440*Impostos!$C$17","v":0},{"$f":"D440*Impostos!$C$18","v":0},{"$f":"D440*Impostos!$C$19","v":0},0,0,null,null,""]
[null,null,null,null,{"$f":"D441*Impostos!$C$15","v":0},{"$f":"D441*Impostos!$C$16","v":0},{"$f":"D441*Impostos!$C$17","v":0},{"$f":"D441*Impostos!$C$18","v":0},{"$f":"D441*Impostos!$C$19","v":0},0,0,null,null,""]
[null,null,null,null,{"$f":"D442*Impostos!$C$15","v":0},{"$f":"D442*Impostos!$C$16","v":0},{"$f":"D442*Impostos!$C$17","v":0},{"$f":"D442*Impostos!$C$18","v":0},{"$f":"D442*Impostos!$C$19","v":0},0,0,null,null,""]
[null,null,null,null,{"$f":"D443*Impostos!$C$15","v":0},{"$f":"D443*Impostos!$C$16","v":0},{"$f":"D443*Impostos!$C$17","v":0},{"$f":"D443*Impostos!$C$18","v":0},{"$f":"D443*Impostos!$C$19","v":0},0,0,null,null,""]
[null,null,null,null,{"$f":"D444*Impostos!$C$15","v":0},{"$f":"D444*Impostos!$C$16","v":0},{"$f":"D444*Impostos!$C$17","v":0},{"$f":"D444*Impostos!$C$18","v":0},{"$f":"D444*Impostos!$C$19","v":0},0,0,null,null,""]
[null,null,null,null,{"$f":"D445*Impostos!$C$15","v":0},{"$f":"D445*Impostos!$C$16","v":0},{"$f":"D445*Impostos!$C$17","v":0},{"$f":"D445*Impostos!$C$18","v":0},{"$f":"D445*Impostos!$C$19","v":0},0,0,null,null,""]
[null,null,null,null,{"$f":"D446*Impostos!$C$15","v":0},{"$f":"D446*Impostos!$C$16","v":0},{"$f":"D446*Impostos!$C$17","v":0},{"$f":"D446*Impostos!$C$18","v":0},{"$f":"D446*Impostos!$C$19","v":0},0,0,null,null,""]
[null,null,null,null,{"$f":"D447*Impostos!$C$15","v":0},{"$f":"D447*Impostos!$C$16","v":0},{"$f":"D447*Impostos!$C$17","v":0},{"$f":"D447*Impostos!$C$18","v":0},{"$f":"D447*Impostos!$C$19","v":0},0,0,null,null,""]
[null,null,null,null,{"$f":"D448*Impostos!$C$15","v":0},{"$f":"D448*Impostos!$C$16","v":0},{"$f":"D448*Impostos!$C$17","v":0},{"$f":"D448*Impostos!$C$18","v":0},{"$f":"D448*Impostos!$C$19","v":0},0,0,null,null,""]
[null,null,null,null,{"$f":"D449*Impostos!$C$15","v":0},{"$f":"D449*Impostos!$C$16","v":0},{"$f":"D449*Impostos!$C$17","v":0},{"$f":"D449*Impostos!$C$18","v":0},{"$f":"D449*Impostos!$C$19","v":0},0,0,null,null,""]
[null,null,null,null,{"$f":"D450*Impostos!$C$15","v":0},{"$f":"D450*Impostos!$C$16","v":0},{"$f":"D450*Impostos!$C$17","v":0},{"$f":"D450*Impostos!$C$18","v":0},{"$f":"D450*Impostos!$C$19","v":0},0,0,null,null,""]
[null,null,null,null,{"$f":"D451*Impostos!$C$15","v":0},{"$f":"D451*Impostos!$C$16","v":0},{"$f":"D451*Impostos!$C$17","v":0},{"$f":"D451*Impostos!$C$18","v":0},{"$f":"D451*Impostos!$C$19","v":0},0,0,null,null,""]
[null,null,null,null,{"$f":"D452*Impostos!$C$15","v":0},{"$f":"D452*Impostos!$C$16","v":0},{"$f":"D452*Impostos!$C$17","v":0},{"$f":"D452*Impostos!$C$18","v":0},{"$f":"D452*Impostos!$C$19","v":0},0,0,null,null,""]
[null,null,null,null,{"$f":"D453*Impostos!$C$15","v":0},{"$f":"D453*Impostos!$C$16","v":0},{"$f":"D453*Impostos!$C$17","v":0},{"$f":"D453*Impostos!$C$18","v":0},{"$f":"D453*Impostos!$C$19","v":0},0,0,null,null,""]
[null,null,null,null,{"$f":"D454*Impostos!$C$15","v":0},{"$f":"D454*Impostos!$C$16","v":0},{"$f":"D454*Impostos!$C$17","v":0},{"$f":"D454*Impostos!$C$18","v":0},{"$f":"D454*Impostos!$C$19","v":0},0,0,null,null,""]
[null,null,null,null,{"$f":"D455*Impostos!$C$15","v":0},{"$f":"D455*Impostos!$C$16","v":0},{"$f":"D455*Impostos!$C$17","v":0},{"$f":"D455*Impostos!$C$18","v":0},{"$f":"D455*Impostos!$C$19","v":0},0,0,null,null,""]
[null,null,null,null,{"$f":"D456*Impostos!$C$15","v":0},{"$f":"D456*Impostos!$C$16","v":0},{"$f":"D456*Impostos!$C$17","v":0},{"$f":"D456*Impostos!$C$18","v":0},{"$f":"D456*Impostos!$C$19","v":0},0,0,null,null,""]
[null,null,null,null,{"$f":"D457*Impostos!$C$15","v":0},{"$f":"D457*Impostos!$C$16","v":0},{"$f":"D457*Impostos!$C$17","v":0},{"$f":"D457*Impostos!$C$18","v":0},{"$f":"D457*Impostos!$C$19","v":0},0,0,null,null,""]
[null,null,null,null,{"$f":"D458*Impostos!$C$15","v":0},{"$f":"D458*Impostos!$C$16","v":0},{"$f":"D458*Impostos!$C$17","v":0},{"$f":"D458*Impostos!$C$18","v":0},{"$f":"D458*Impostos!$C$19","v":0},0,0,null,null,""]
[null,null,null,null,{"$f":"D459*Impostos!$C$15","v":0},{"$f":"D459*Impostos!$C$16","v":0},{"$f":"D459*Impostos!$C$17","v":0},{"$f":"D459*Impostos!$C$18","v":0},{"$f":"D459*Impostos!$C$19","v":0},0,0,null,null,""]
[null,null,null,null,{"$f":"D460*Impostos!$C$15","v":0},{"$f":"D460*Impostos!$C$16","v":0},{"$f":"D460*Impostos!$C$17","v":0},{"$f":"D460*Impostos!$C$18","v":0},{"$f":"D460*Impostos!$C$19","v":0},0,0,null,null,""]
[null,null,null,null,{"$f":"D461*Impostos!$C$15","v":0},{"$f":"D461*Impostos!$C$16","v":0},{"$f":"D461*Impostos!$C$17","v":0},{"$f":"D461*Impostos!$C$18","v":0},{"$f":"D461*Impostos!$C$19","v":0},0,0,null,null,""]
[null,null,null,null,{"$f":"D462*Impostos!$C$15","v":0},{"$f":"D462*Impostos!$C$16","v":0},{"$f":"D462*Impostos!$C$17","v":0},{"$f":"D462*Impostos!$C$18","v":0},{"$f":"D462*Impostos!$C$19","v":0},0,0,null,null,""]
[null,null,null,null,{"$f":"D463*Impostos!$C$15","v":0},{"$f":"D463*Impostos!$C$16","v":0},{"$f":"D463*Impostos!$C$17","v":0},{"$f":"D463*Impostos!$C$18","v":0},{"$f":"D463*Impostos!$C$19","v":0},0,0,null,null,""]
[null,null,null,null,{"$f":"D464*Impostos!$C$15","v":0},{"$f":"D464*Impostos!$C$16","v":0},{"$f":"D464*Impostos!$C$17","v":0},{"$f":"D464*Impostos!$C$18","v":0},{"$f":"D464*Impostos!$C$19","v":0},0,0,null,null,{"$f":"IF(C464=\"\",\"\",MONTH(C464))","v":""}]
[null,null,null,null,{"$f":"D465*Impostos!$C$15","v":0},{"$f":"D465*Impostos!$C$16","v":0},{"$f":"D465*Impostos!$C$17","v":0},{"$f":"D465*Impostos!$C$18","v":0},{"$f":"D465*Impostos!$C$19","v":0},0,0,null,null,""]
[null,null,null,null,{"$f":"D466*Impostos!$C$15","v":0},{"$f":"D466*Impostos!$C$16","v":0},{"$f":"D466*Impostos!$C$17","v":0},{"$f":"D466*Impostos!$C$18","v":0},{"$f":"D466*Impostos!$C$19","v":0},0,0,null,null,""]
[null,null,null,null,{"$f":"D467*Impostos!$C$15","v":0},{"$f":"D467*Impostos!$C$16","v":0},{"$f":"D467*Impostos!$C$17","v":0},{"$f":"D467*Impostos!$C$18","v":0},{"$f":"D467*Impostos!$C$19","v":0},0,0,null,null,""]
[null,null,null,null,{"$f":"D468*Impostos!$C$15","v":0},{"$f":"D468*Impostos!$C$16","v":0},{"$f":"D468*Impostos!$C$17","v":0},{"$f":"D468*Impostos!$C$18","v":0},{"$f":"D468*Impostos!$C$19","v":0},0,0,null,null,""]
[null,null,null,null,{"$f":"D469*Impostos!$C$15","v":0},{"$f":"D469*Impostos!$C$16","v":0},{"$f":"D469*Impostos!$C$17","v":0},{"$f":"D469*Impostos!$C$18","v":0},{"$f":"D469*Impostos!$C$19","v":0},0,0,null,null,""]
[null,null,null,null,{"$f":"D470*Impostos!$C$15","v":0},{"$f":"D470*Impostos!$C$16","v":0},{"$f":"D470*Impostos!$C$17","v":0},{"$f":"D470*Impostos!$C$18","v":0},{"$f":"D470*Impostos!$C$19","v":0},0,0,null,null,""]
[null,null,null,null,{"$f":"D471*Impostos!$C$15","v":0},{"$f":"D471*Impostos!$C$16","v":0},{"$f":"D471*Impostos!$C$17","v":0},{"$f":"D471*Impostos!$C$18","v":0},{"$f":"D471*Impostos!$C$19","v":0},0,0,null,null,""]
[null,null,null,null,{"$f":"D472*Impostos!$C$15","v":0},{"$f":"D472*Impostos!$C$16","v":0},{"$f":"D472*Impostos!$C$17","v":0},{"$f":"D472*Impostos!$C$18","v":0},{"$f":"D472*Impostos!$C$19","v":0},{"$f":"SUM(E472:I472)","v":0},{"$f":"D472-J472","v":0},null,null,""]
[null,null,null,null,{"$f":"D473*Impostos!$C$15","v":0},{"$f":"D473*Impostos!$C$16","v":0},{"$f":"D473*Impostos!$C$17","v":0},{"$f":"D473*Impostos!$C$18","v":0},{"$f":"D473*Impostos!$C$19","v":0},0,0,null,null,""]
[null,null,null,null,{"$f":"D474*Impostos!$C$15","v":0},{"$f":"D474*Impostos!$C$16","v":0},{"$f":"D474*Impostos!$C$17","v":0},{"$f":"D474*Impostos!$C$18","v":0},{"$f":"D474*Impostos!$C$19","v":0},0,0,null,null,""]
[null,null,null,null,{"$f":"D475*Impostos!$C$15","v":0},{"$f":"D475*Impostos!$C$16","v":0},{"$f":"D475*Impostos!$C$17","v":0},{"$f":"D475*Impostos!$C$18","v":0},{"$f":"D475*Impostos!$C$19","v":0},0,0,null,null,""]
[null,null,null,null,{"$f":"D476*Impostos!$C$15","v":0},{"$f":"D476*Impostos!$C$16","v":0},{"$f":"D476*Impostos!$C$17","v":0},{"$f":"D476*Impostos!$C$18","v":0},{"$f":"D476*Impostos!$C$19","v":0},0,0,null,null,""]
[null,null,null,null,{"$f":"D477*Impostos!$C$15","v":0},{"$f":"D477*Impostos!$C$16","v":0},{"$f":"D477*Impostos!$C$17","v":0},{"$f":"D477*Impostos!$C$18","v":0},{"$f":"D477*Impostos!$C$19","v":0},0,0,null,null,""]
[null,null,null,null,{"$f":"D478*Impostos!$C$15","v":0},{"$f":"D478*Impostos!$C$16","v":0},{"$f":"D478*Impostos!$C$17","v":0},{"$f":"D478*Impostos!$C$18","v":0},{"$f":"D478*Impostos!$C$19","v":0},0,0,null,null,""]
[null,null,null,null,{"$f":"D479*Impostos!$C$15","v":0},{"$f":"D479*Impostos!$C$16","v":0},{"$f":"D479*Impostos!$C$17","v":0},{"$f":"D479*Impostos!$C$18","v":0},{"$f":"D479*Impostos!$C$19","v":0},0,0,null,null,""]
[null,null,null,null,{"$f":"D480*Impostos!$C$15","v":0},{"$f":"D480*Impostos!$C$16","v":0},{"$f":"D480*Impostos!$C$17","v":0},{"$f":"D480*Impostos!$C$18","v":0},{"$f":"D480*Impostos!$C$19","v":0},0,0,null,null,""]
[null,null,null,null,{"$f":"D481*Impostos!$C$15","v":0},{"$f":"D481*Impostos!$C$16","v":0},{"$f":"D481*Impostos!$C$17","v":0},{"$f":"D481*Impostos!$C$18","v":0},{"$f":"D481*Impostos!$C$19","v":0},0,0,null,null,""]
[null,null,null,null,{"$f":"D482*Impostos!$C$15","v":0},{"$f":"D482*Impostos!$C$16","v":0},{"$f":"D482*Impostos!$C$17","v":0},{"$f":"D482*Impostos!$C$18","v":0},{"$f":"D482*Impostos!$C$19","v":0},0,0,null,null,""]
[null,null,null,null,{"$f":"D483*Impostos!$C$15","v":0},{"$f":"D483*Impostos!$C$16","v":0},{"$f":"D483*Impostos!$C$17","v":0},{"$f":"D483*Impostos!$C$18","v":0},{"$f":"D483*Impostos!$C$19","v":0},0,0,null,null,""]
[null,null,null,null,{"$f":"D484*Impostos!$C$15","v":0},{"$f":"D484*Impostos!$C$16","v":0},{"$f":"D484*Impostos!$C$17","v":0},{"$f":"D484*Impostos!$C$18","v":0},{"$f":"D484*Impostos!$C$19","v":0},0,0,null,null,""]
[null,null,null,null,{"$f":"D485*Impostos!$C$15","v":0},{"$f":"D485*Impostos!$C$16","v":0},{"$f":"D485*Impostos!$C$17","v":0},{"$f":"D485*Impostos!$C$18","v":0},{"$f":"D485*Impostos!$C$19","v":0},0,0,null,null,""]
[null,null,null,null,{"$f":"D486*Impostos!$C$15","v":0},{"$f":"D486*Impostos!$C$16","v":0},{"$f":"D486*Impostos!$C$17","v":0},{"$f":"D486*Impostos!$C$18","v":0},{"$f":"D486*Impostos!$C$19","v":0},0,0,null,null,""]
[null,null,null,null,{"$f":"D487*Impostos!$C$15","v":0},{"$f":"D487*Impostos!$C$16","v":0},{"$f":"D487*Impostos!$C$17","v":0},{"$f":"D487*Impostos!$C$18","v":0},{"$f":"D487*Impostos!$C$19","v":0},0,0,null,null,""]
[null,null,null,null,{"$f":"D488*Impostos!$C$15","v":0},{"$f":"D488*Impostos!$C$16","v":0},{"$f":"D488*Impostos!$C$17","v":0},{"$f":"D488*Impostos!$C$18","v":0},{"$f":"D488*Impostos!$C$19","v":0},0,0,null,null,""]
[null,null,null,null,{"$f":"D489*Impostos!$C$15","v":0},{"$f":"D489*Impostos!$C$16","v":0},{"$f":"D489*Impostos!$C$17","v":0},{"$f":"D489*Impostos!$C$18","v":0},{"$f":"D489*Impostos!$C$19","v":0},0,0,null,null,""]
[null,null,null,null,{"$f":"D490*Impostos!$C$15","v":0},{"$f":"D490*Impostos!$C$16","v":0},{"$f":"D490*Impostos!$C$17","v":0},{"$f":"D490*Impostos!$C$18","v":0},{"$f":"D490*Impostos!$C$19","v":0},0,0,null,null,""]
[null,null,null,null,{"$f":"D491*Impostos!$C$15","v":0},{"$f":"D491*Impostos!$C$16","v":0},{"$f":"D491*Impostos!$C$17","v":0},{"$f":"D491*Impostos!$C$18","v":0},{"$f":"D491*Impostos!$C$19","v":0},0,0,null,null,""]
[null,null,null,null,{"$f":"D492*Impostos!$C$15","v":0},{"$f":"D492*Impostos!$C$16","v":0},{"$f":"D492*Impostos!$C$17","v":0},{"$f":"D492*Impostos!$C$18","v":0},{"$f":"D492*Impostos!$C$19","v":0},0,0,null,null,""]
[null,null,null,null,{"$f":"D493*Impostos!$C$15","v":0},{"$f":"D493*Impostos!$C$16","v":0},{"$f":"D493*Impostos!$C$17","v":0},{"$f":"D493*Impostos!$C$18","v":0},{"$f":"D493*Impostos!$C$19","v":0},0,0,null,null,""]
[null,null,null,null,{"$f":"D494*Impostos!$C$15","v":0},{"$f":"D494*Impostos!$C$16","v":0},{"$f":"D494*Impostos!$C$17","v":0},{"$f":"D494*Impostos!$C$18","v":0},{"$f":"D494*Impostos!$C$19","v":0},0,0,null,null,""]
[null,null,null,null,{"$f":"D495*Impostos!$C$15","v":0},{"$f":"D495*Impostos!$C$16","v":0},{"$f":"D495*Impostos!$C$17","v":0},{"$f":"D495*Impostos!$C$18","v":0},{"$f":"D495*Impostos!$C$19","v":0},0,0,null,null,""]
[null,null,null,null,{"$f":"D496*Impostos!$C$15","v":0},{"$f":"D496*Impostos!$C$16","v":0},{"$f":"D496*Impostos!$C$17","v":0},{"$f":"D496*Impostos!$C$18","v":0},{"$f":"D496*Impostos!$C$19","v":0},0,0,null,null,""]
[null,null,null,null,{"$f":"D497*Impostos!$C$15","v":0},{"$f":"D497*Impostos!$C$16","v":0},{"$f":"D497*Impostos!$C$17","v":0},{"$f":"D497*Impostos!$C$18","v":0},{"$f":"D497*Impostos!$C$19","v":0},0,0,null,null,""]
[null,null,null,null,{"$f":"D498*Impostos!$C$15","v":0},{"$f":"D498*Impostos!$C$16","v":0},{"$f":"D498*Impostos!$C$17","v":0},{"$f":"D498*Impostos!$C$18","v":0},{"$f":"D498*Impostos!$C$19","v":0},0,0,null,null,""]
[null,null,null,null,{"$f":"D499*Impostos!$C$15","v":0},{"$f":"D499*Impostos!$C$16","v":0},{"$f":"D499*Impostos!$C$17","v":0},{"$f":"D499*Impostos!$C$18","v":0},{"$f":"D499*Impostos!$C$19","v":0},0,0,null,null,""]
[null,null,null,null,{"$f":"D500*Impostos!$C$15","v":0},{"$f":"D500*Impostos!$C$16","v":0},{"$f":"D500*Impostos!$C$17","v":0},{"$f":"D500*Impostos!$C$18","v":0},{"$f":"D500*Impostos!$C$19","v":0},0,0,null,null,""]
[null,null,null,null,{"$f":"D501*Impostos!$C$15","v":0},{"$f":"D501*Impostos!$C$16","v":0},{"$f":"D501*Impostos!$C$17","v":0},{"$f":"D501*Impostos!$C$18","v":0},{"$f":"D501*Impostos!$C$19","v":0},0,0,null,null,""]
[null,null,null,null,{"$f":"D502*Impostos!$C$15","v":0},{"$f":"D502*Impostos!$C$16","v":0},{"$f":"D502*Impostos!$C$17","v":0},{"$f":"D502*Impostos!$C$18","v":0},{"$f":"D502*Impostos!$C$19","v":0},0,0,null,null,""]
[null,null,null,null,{"$f":"D503*Impostos!$C$15","v":0},{"$f":"D503*Impostos!$C$16","v":0},{"$f":"D503*Impostos!$C$17","v":0},{"$f":"D503*Impostos!$C$18","v":0},{"$f":"D503*Impostos!$C$19","v":0},0,0,null,null,""]
[null,null,null,null,{"$f":"D504*Impostos!$C$15","v":0},{"$f":"D504*Impostos!$C$16","v":0},{"$f":"D504*Impostos!$C$17","v":0},{"$f":"D504*Impostos!$C$18","v":0},{"$f":"D504*Impostos!$C$19","v":0},0,0,null,null,""]
[null,null,null,null,{"$f":"D505*Impostos!$C$15","v":0},{"$f":"D505*Impostos!$C$16","v":0},{"$f":"D505*Impostos!$C$17","v":0},{"$f":"D505*Impostos!$C$18","v":0},{"$f":"D505*Impostos!$C$19","v":0},0,0,null,null,""]
[null,null,null,null,{"$f":"D506*Impostos!$C$15","v":0},{"$f":"D506*Impostos!$C$16","v":0},{"$f":"D506*Impostos!$C$17","v":0},{"$f":"D506*Impostos!$C$18","v":0},{"$f":"D506*Impostos!$C$19","v":0},0,0,null,null,""]
[null,null,null,null,{"$f":"D507*Impostos!$C$15","v":0},{"$f":"D507*Impostos!$C$16","v":0},{"$f":"D507*Impostos!$C$17","v":0},{"$f":"D507*Impostos!$C$18","v":0},{"$f":"D507*Impostos!$C$19","v":0},0,0,null,null,""]
[null,null,null,null,{"$f":"D508*Impostos!$C$15","v":0},{"$f":"D508*Impostos!$C$16","v":0},{"$f":"D508*Impostos!$C$17","v":0},{"$f":"D508*Impostos!$C$18","v":0},{"$f":"D508*Impostos!$C$19","v":0},0,0,null,null,""]
[null,null,null,null,{"$f":"D509*Impostos!$C$15","v":0},{"$f":"D509*Impostos!$C$16","v":0},{"$f":"D509*Impostos!$C$17","v":0},{"$f":"D509*Impostos!$C$18","v":0},{"$f":"D509*Impostos!$C$19","v":0},0,0,null,null,""]
[null,null,null,null,{"$f":"D510*Impostos!$C$15","v":0},{"$f":"D510*Impostos!$C$16","v":0},{"$f":"D510*Impostos!$C$17","v":0},{"$f":"D510*Impostos!$C$18","v":0},{"$f":"D510*Impostos!$C$19","v":0},0,0,null,null,""]
[null,null,null,null,{"$f":"D511*Impostos!$C$15","v":0},{"$f":"D511*Impostos!$C$16","v":0},{"$f":"D511*Impostos!$C$17","v":0},{"$f":"D511*Impostos!$C$18","v":0},{"$f":"D511*Impostos!$C$19","v":0},0,0,null,null,""]
[null,null,null,null,{"$f":"D512*Impostos!$C$15","v":0},{"$f":"D512*Impostos!$C$16","v":0},{"$f":"D512*Impostos!$C$17","v":0},{"$f":"D512*Impostos!$C$18","v":0},{"$f":"D512*Impostos!$C$19","v":0},0,0,null,null,""]
[null,null,null,null,{"$f":"D513*Impostos!$C$15","v":0},{"$f":"D513*Impostos!$C$16","v":0},{"$f":"D513*Impostos!$C$17","v":0},{"$f":"D513*Impostos!$C$18","v":0},{"$f":"D513*Impostos!$C$19","v":0},0,0,null,null,""]
[null,null,null,null,{"$f":"D514*Impostos!$C$15","v":0},{"$f":"D514*Impostos!$C$16","v":0},{"$f":"D514*Impostos!$C$17","v":0},{"$f":"D514*Impostos!$C$18","v":0},{"$f":"D514*Impostos!$C$19","v":0},0,0,null,null,""]
[null,null,null,null,{"$f":"D515*Impostos!$C$15","v":0},{"$f":"D515*Impostos!$C$16","v":0},{"$f":"D515*Impostos!$C$17","v":0},{"$f":"D515*Impostos!$C$18","v":0},{"$f":"D515*Impostos!$C$19","v":0},0,0,null,null,""]
[null,null,null,null,{"$f":"D516*Impostos!$C$15","v":0},{"$f":"D516*Impostos!$C$16","v":0},{"$f":"D516*Impostos!$C$17","v":0},{"$f":"D516*Impostos!$C$18","v":0},{"$f":"D516*Impostos!$C$19","v":0},0,0,null,null,""]
[null,null,null,null,{"$f":"D517*Impostos!$C$15","v":0},{"$f":"D517*Impostos!$C$16","v":0},{"$f":"D517*Impostos!$C$17","v":0},{"$f":"D517*Impostos!$C$18","v":0},{"$f":"D517*Impostos!$C$19","v":0},0,0,null,null,""]
[null,null,null,null,{"$f":"D518*Impostos!$C$15","v":0},{"$f":"D518*Impostos!$C$16","v":0},{"$f":"D518*Impostos!$C$17","v":0},{"$f":"D518*Impostos!$C$18","v":0},{"$f":"D518*Impostos!$C$19","v":0},0,0,null,null,""]
[null,null,null,null,{"$f":"D519*Impostos!$C$15","v":0},{"$f":"D519*Impostos!$C$16","v":0},{"$f":"D519*Impostos!$C$17","v":0},{"$f":"D519*Impostos!$C$18","v":0},{"$f":"D519*Impostos!$C$19","v":0},0,0,null,null,""]
[null,null,null,null,{"$f":"D520*Impostos!$C$15","v":0},{"$f":"D520*Impostos!$C$16","v":0},{"$f":"D520*Impostos!$C$17","v":0},{"$f":"D520*Impostos!$C$18","v":0},{"$f":"D520*Impostos!$C$19","v":0},0,0,null,null,""]
[null,null,null,null,{"$f":"D521*Impostos!$C$15","v":0},{"$f":"D521*Impostos!$C$16","v":0},{"$f":"D521*Impostos!$C$17","v":0},{"$f":"D521*Impostos!$C$18","v":0},{"$f":"D521*Impostos!$C$19","v":0},0,0,null,null,""]
[null,null,null,null,{"$f":"D522*Impostos!$C$15","v":0},{"$f":"D522*Impostos!$C$16","v":0},{"$f":"D522*Impostos!$C$17","v":0},{"$f":"D522*Impostos!$C$18","v":0},{"$f":"D522*Impostos!$C$19","v":0},0,0,null,null,""]
[null,null,null,null,{"$f":"D523*Impostos!$C$15","v":0},{"$f":"D523*Impostos!$C$16","v":0},{"$f":"D523*Impostos!$C$17","v":0},{"$f":"D523*Impostos!$C$18","v":0},{"$f":"D523*Impostos!$C$19","v":0},0,0,null,null,""]
[null,null,null,null,{"$f":"D524*Impostos!$C$15","v":0},{"$f":"D524*Impostos!$C$16","v":0},{"$f":"D524*Impostos!$C$17","v":0},{"$f":"D524*Impostos!$C$18","v":0},{"$f":"D524*Impostos!$C$19","v":0},0,0,null,null,""]
[null,null,null,null,{"$f":"D525*Impostos!$C$15","v":0},{"$f":"D525*Impostos!$C$16","v":0},{"$f":"D525*Impostos!$C$17","v":0},{"$f":"D525*Impostos!$C$18","v":0},{"$f":"D525*Impostos!$C$19","v":0},0,0,null,null,""]
[null,null,null,null,{"$f":"D526*Impostos!$C$15","v":0},{"$f":"D526*Impostos!$C$16","v":0},{"$f":"D526*Impostos!$C$17","v":0},{"$f":"D526*Impostos!$C$18","v":0},{"$f":"D526*Impostos!$C$19","v":0},0,0,null,null,""]
[null,null,null,null,{"$f":"D527*Impostos!$C$15","v":0},{"$f":"D527*Impostos!$C$16","v":0},{"$f":"D527*Impostos!$C$17","v":0},{"$f":"D527*Impostos!$C$18","v":0},{"$f":"D527*Impostos!$C$19","v":0},0,0,null,null,""]
[null,null,null,null,{"$f":"D528*Impostos!$C$15","v":0},{"$f":"D528*Impostos!$C$16","v":0},{"$f":"D528*Impostos!$C$17","v":0},{"$f":"D528*Impostos!$C$18","v":0},{"$f":"D528*Impostos!$C$19","v":0},0,0,null,null,{"$f":"IF(C528=\"\",\"\",MONTH(C528))","v":""}]
[null,null,null,null,{"$f":"D529*Impostos!$C$15","v":0},{"$f":"D529*Impostos!$C$16","v":0},{"$f":"D529*Impostos!$C$17","v":0},{"$f":"D529*Impostos!$C$18","v":0},{"$f":"D529*Impostos!$C$19","v":0},0,0,null,null,""]
[null,null,null,null,{"$f":"D530*Impostos!$C$15","v":0},{"$f":"D530*Impostos!$C$16","v":0},{"$f":"D530*Impostos!$C$17","v":0},{"$f":"D530*Impostos!$C$18","v":0},{"$f":"D530*Impostos!$C$19","v":0},0,0,null,null,""]
[null,null,null,null,{"$f":"D531*Impostos!$C$15","v":0},{"$f":"D531*Impostos!$C$16","v":0},{"$f":"D531*Impostos!$C$17","v":0},{"$f":"D531*Impostos!$C$18","v":0},{"$f":"D531*Impostos!$C$19","v":0},0,0,null,null,""]
[null,null,null,null,{"$f":"D532*Impostos!$C$15","v":0},{"$f":"D532*Impostos!$C$16","v":0},{"$f":"D532*Impostos!$C$17","v":0},{"$f":"D532*Impostos!$C$18","v":0},{"$f":"D532*Impostos!$C$19","v":0},0,0,null,null,""]
[null,null,null,null,{"$f":"D533*Impostos!$C$15","v":0},{"$f":"D533*Impostos!$C$16","v":0},{"$f":"D533*Impostos!$C$17","v":0},{"$f":"D533*Impostos!$C$18","v":0},{"$f":"D533*Impostos!$C$19","v":0},0,0,null,null,""]
[null,null,null,null,{"$f":"D534*Impostos!$C$15","v":0},{"$f":"D534*Impostos!$C$16","v":0},{"$f":"D534*Impostos!$C$17","v":0},{"$f":"D534*Impostos!$C$18","v":0},{"$f":"D534*Impostos!$C$19","v":0},0,0,null,null,""]
[null,null,null,null,{"$f":"D535*Impostos!$C$15","v":0},{"$f":"D535*Impostos!$C$16","v":0},{"$f":"D535*Impostos!$C$17","v":0},{"$f":"D535*Impostos!$C$18","v":0},{"$f":"D535*Impostos!$C$19","v":0},0,0,null,null,""]
[null,null,null,null,{"$f":"D536*Impostos!$C$15","v":0},{"$f":"D536*Impostos!$C$16","v":0},{"$f":"D536*Impostos!$C$17","v":0},{"$f":"D536*Impostos!$C$18","v":0},{"$f":"D536*Impostos!$C$19","v":0},{"$f":"SUM(E536:I536)","v":0},{"$f":"D536-J536","v":0},null,null,""]
[null,null,null,null,{"$f":"D537*Impostos!$C$15","v":0},{"$f":"D537*Impostos!$C$16","v":0},{"$f":"D537*Impostos!$C$17","v":0},{"$f":"D537*Impostos!$C$18","v":0},{"$f":"D537*Impostos!$C$19","v":0},0,0,null,null,""]
[null,null,null,null,{"$f":"D538*Impostos!$C$15","v":0},{"$f":"D538*Impostos!$C$16","v":0},{"$f":"D538*Impostos!$C$17","v":0},{"$f":"D538*Impostos!$C$18","v":0},{"$f":"D538*Impostos!$C$19","v":0},0,0,null,null,""]
[null,null,null,null,{"$f":"D539*Impostos!$C$15","v":0},{"$f":"D539*Impostos!$C$16","v":0},{"$f":"D539*Impostos!$C$17","v":0},{"$f":"D539*Impostos!$C$18","v":0},{"$f":"D539*Impostos!$C$19","v":0},0,0,null,null,""]
[null,null,null,null,{"$f":"D540*Impostos!$C$15","v":0},{"$f":"D540*Impostos!$C$16","v":0},{"$f":"D540*Impostos!$C$17","v":0},{"$f":"D540*Impostos!$C$18","v":0},{"$f":"D540*Impostos!$C$19","v":0},0,0,null,null,""]
[null,null,null,null,{"$f":"D541*Impostos!$C$15","v":0},{"$f":"D541*Impostos!$C$16","v":0},{"$f":"D541*Impostos!$C$17","v":0},{"$f":"D541*Impostos!$C$18","v":0},{"$f":"D541*Impostos!$C$19","v":0},0,0,null,null,""]
[null,null,null,null,{"$f":"D542*Impostos!$C$15","v":0},{"$f":"D542*Impostos!$C$16","v":0},{"$f":"D542*Impostos!$C$17","v":0},{"$f":"D542*Impostos!$C$18","v":0},{"$f":"D542*Impostos!$C$19","v":0},0,0,null,null,""]
[null,null,null,null,{"$f":"D543*Impostos!$C$15","v":0},{"$f":"D543*Impostos!$C$16","v":0},{"$f":"D543*Impostos!$C$17","v":0},{"$f":"D543*Impostos!$C$18","v":0},{"$f":"D543*Impostos!$C$19","v":0},0,0,null,null,""]
[null,null,null,null,{"$f":"D544*Impostos!$C$15","v":0},{"$f":"D544*Impostos!$C$16","v":0},{"$f":"D544*Impostos!$C$17","v":0},{"$f":"D544*Impostos!$C$18","v":0},{"$f":"D544*Impostos!$C$19","v":0},0,0,null,null,""]
[null,null,null,null,{"$f":"D545*Impostos!$C$15","v":0},{"$f":"D545*Impostos!$C$16","v":0},{"$f":"D545*Impostos!$C$17","v":0},{"$f":"D545*Impostos!$C$18","v":0},{"$f":"D545*Impostos!$C$19","v":0},0,0,null,null,""]
[null,null,null,null,{"$f":"D546*Impostos!$C$15","v":0},{"$f":"D546*Impostos!$C$16","v":0},{"$f":"D546*Impostos!$C$17","v":0},{"$f":"D546*Impostos!$C$18","v":0},{"$f":"D546*Impostos!$C$19","v":0},0,0,null,null,""]
[null,null,null,null,{"$f":"D547*Impostos!$C$15","v":0},{"$f":"D547*Impostos!$C$16","v":0},{"$f":"D547*Impostos!$C$17","v":0},{"$f":"D547*Impostos!$C$18","v":0},{"$f":"D547*Impostos!$C$19","v":0},0,0,null,null,""]
[null,null,null,null,{"$f":"D548*Impostos!$C$15","v":0},{"$f":"D548*Impostos!$C$16","v":0},{"$f":"D548*Impostos!$C$17","v":0},{"$f":"D548*Impostos!$C$18","v":0},{"$f":"D548*Impostos!$C$19","v":0},0,0,null,null,""]
[null,null,null,null,{"$f":"D549*Impostos!$C$15","v":0},{"$f":"D549*Impostos!$C$16","v":0},{"$f":"D549*Impostos!$C$17","v":0},{"$f":"D549*Impostos!$C$18","v":0},{"$f":"D549*Impostos!$C$19","v":0},0,0,null,null,""]
[null,null,null,null,{"$f":"D550*Impostos!$C$15","v":0},{"$f":"D550*Impostos!$C$16","v":0},{"$f":"D550*Impostos!$C$17","v":0},{"$f":"D550*Impostos!$C$18","v":0},{"$f":"D550*Impostos!$C$19","v":0},0,0,null,null,""]
[null,null,null,null,{"$f":"D551*Impostos!$C$15","v":0},{"$f":"D551*Impostos!$C$16","v":0},{"$f":"D551*Impostos!$C$17","v":0},{"$f":"D551*Impostos!$C$18","v":0},{"$f":"D551*Impostos!$C$19","v":0},0,0,null,null,""]
[null,null,null,null,{"$f":"D552*Impostos!$C$15","v":0},{"$f":"D552*Impostos!$C$16","v":0},{"$f":"D552*Impostos!$C$17","v":0},{"$f":"D552*Impostos!$C$18","v":0},{"$f":"D552*Impostos!$C$19","v":0},0,0,null,null,""]
[null,null,null,null,{"$f":"D553*Impostos!$C$15","v":0},{"$f":"D553*Impostos!$C$16","v":0},{"$f":"D553*Impostos!$C$17","v":0},{"$f":"D553*Impostos!$C$18","v":0},{"$f":"D553*Impostos!$C$19","v":0},0,0,null,null,""]
[null,null,null,null,{"$f":"D554*Impostos!$C$15","v":0},{"$f":"D554*Impostos!$C$16","v":0},{"$f":"D554*Impostos!$C$17","v":0},{"$f":"D554*Impostos!$C$18","v":0},{"$f":"D554*Impostos!$C$19","v":0},0,0,null,null,""]
[null,null,null,null,{"$f":"D555*Impostos!$C$15","v":0},{"$f":"D555*Impostos!$C$16","v":0},{"$f":"D555*Impostos!$C$17","v":0},{"$f":"D555*Impostos!$C$18","v":0},{"$f":"D555*Impostos!$C$19","v":0},0,0,null,null,""]
[null,null,null,null,{"$f":"D556*Impostos!$C$15","v":0},{"$f":"D556*Impostos!$C$16","v":0},{"$f":"D556*Impostos!$C$17","v":0},{"$f":"D556*Impostos!$C$18","v":0},{"$f":"D556*Impostos!$C$19","v":0},0,0,null,null,""]
[null,null,null,null,{"$f":"D557*Impostos!$C$15","v":0},{"$f":"D557*Impostos!$C$16","v":0},{"$f":"D557*Impostos!$C$17","v":0},{"$f":"D557*Impostos!$C$18","v":0},{"$f":"D557*Impostos!$C$19","v":0},0,0,null,null,""]
[null,null,null,null,{"$f":"D558*Impostos!$C$15","v":0},{"$f":"D558*Impostos!$C$16","v":0},{"$f":"D558*Impostos!$C$17","v":0},{"$f":"D558*Impostos!$C$18","v":0},{"$f":"D558*Impostos!$C$19","v":0},0,0,null,null,""]
[null,null,null,null,{"$f":"D559*Impostos!$C$15","v":0},{"$f":"D559*Impostos!$C$16","v":0},{"$f":"D559*Impostos!$C$17","v":0},{"$f":"D559*Impostos!$C$18","v":0},{"$f":"D559*Impostos!$C$19","v":0},0,0,null,null,""]
[null,null,null,null,{"$f":"D560*Impostos!$C$15","v":0},{"$f":"D560*Impostos!$C$16","v":0},{"$f":"D560*Impostos!$C$17","v":0},{"$f":"D560*Impostos!$C$18","v":0},{"$f":"D560*Impostos!$C$19","v":0},0,0,null,null,""]
[null,null,null,null,{"$f":"D561*Impostos!$C$15","v":0},{"$f":"D561*Impostos!$C$16","v":0},{"$f":"D561*Impostos!$C$17","v":0},{"$f":"D561*Impostos!$C$18","v":0},{"$f":"D561*Impostos!$C$19","v":0},0,0,null,null,""]
[null,null,null,null,{"$f":"D562*Impostos!$C$15","v":0},{"$f":"D562*Impostos!$C$16","v":0},{"$f":"D562*Impostos!$C$17","v":0},{"$f":"D562*Impostos!$C$18","v":0},{"$f":"D562*Impostos!$C$19","v":0},0,0,null,null,""]
[null,null,null,null,{"$f":"D563*Impostos!$C$15","v":0},{"$f":"D563*Impostos!$C$16","v":0},{"$f":"D563*Impostos!$C$17","v":0},{"$f":"D563*Impostos!$C$18","v":0},{"$f":"D563*Impostos!$C$19","v":0},0,0,null,null,""]
[null,null,null,null,{"$f":"D564*Impostos!$C$15","v":0},{"$f":"D564*Impostos!$C$16","v":0},{"$f":"D564*Impostos!$C$17","v":0},{"$f":"D564*Impostos!$C$18","v":0},{"$f":"D564*Impostos!$C$19","v":0},0,0,null,null,""]
[null,null,null,null,{"$f":"D565*Impostos!$C$15","v":0},{"$f":"D565*Impostos!$C$16","v":0},{"$f":"D565*Impostos!$C$17","v":0},{"$f":"D565*Impostos!$C$18","v":0},{"$f":"D565*Impostos!$C$19","v":0},0,0,null,null,""]
[null,null,null,null,{"$f":"D566*Impostos!$C$15","v":0},{"$f":"D566*Impostos!$C$16","v":0},{"$f":"D566*Impostos!$C$17","v":0},{"$f":"D566*Impostos!$C$18","v":0},{"$f":"D566*Impostos!$C$19","v":0},0,0,null,null,""]
[null,null,null,null,{"$f":"D567*Impostos!$C$15","v":0},{"$f":"D567*Impostos!$C$16","v":0},{"$f":"D567*Impostos!$C$17","v":0},{"$f":"D567*Impostos!$C$18","v":0},{"$f":"D567*Impostos!$C$19","v":0},0,0,null,null,""]
[null,null,null,null,{"$f":"D568*Impostos!$C$15","v":0},{"$f":"D568*Impostos!$C$16","v":0},{"$f":"D568*Impostos!$C$17","v":0},{"$f":"D568*Impostos!$C$18","v":0},{"$f":"D568*Impostos!$C$19","v":0},0,0,null,null,""]
[null,null,null,null,{"$f":"D569*Impostos!$C$15","v":0},{"$f":"D569*Impostos!$C$16","v":0},{"$f":"D569*Impostos!$C$17","v":0},{"$f":"D569*Impostos!$C$18","v":0},{"$f":"D569*Impostos!$C$19","v":0},0,0,null,null,""]
[null,null,null,null,{"$f":"D570*Impostos!$C$15","v":0},{"$f":"D570*Impostos!$C$16","v":0},{"$f":"D570*Impostos!$C$17","v":0},{"$f":"D570*Impostos!$C$18","v":0},{"$f":"D570*Impostos!$C$19","v":0},0,0,null,null,""]
[null,null,null,null,{"$f":"D571*Impostos!$C$15","v":0},{"$f":"D571*Impostos!$C$16","v":0},{"$f":"D571*Impostos!$C$17","v":0},{"$f":"D571*Impostos!$C$18","v":0},{"$f":"D571*Impostos!$C$19","v":0},0,0,null,null,""]
[null,null,null,null,{"$f":"D572*Impostos!$C$15","v":0},{"$f":"D572*Impostos!$C$16","v":0},{"$f":"D572*Impostos!$C$17","v":0},{"$f":"D572*Impostos!$C$18","v":0},{"$f":"D572*Impostos!$C$19","v":0},0,0,null,null,""]
[null,null,null,null,{"$f":"D573*Impostos!$C$15","v":0},{"$f":"D573*Impostos!$C$16","v":0},{"$f":"D573*Impostos!$C$17","v":0},{"$f":"D573*Impostos!$C$18","v":0},{"$f":"D573*Impostos!$C$19","v":0},0,0,null,null,""]
[null,null,null,null,{"$f":"D574*Impostos!$C$15","v":0},{"$f":"D574*Impostos!$C$16","v":0},{"$f":"D574*Impostos!$C$17","v":0},{"$f":"D574*Impostos!$C$18","v":0},{"$f":"D574*Impostos!$C$19","v":0},0,0,null,null,""]
[null,null,null,null,{"$f":"D575*Impostos!$C$15","v":0},{"$f":"D575*Impostos!$C$16","v":0},{"$f":"D575*Impostos!$C$17","v":0},{"$f":"D575*Impostos!$C$18","v":0},{"$f":"D575*Impostos!$C$19","v":0},0,0,null,null,""]
[null,null,null,null,{"$f":"D576*Impostos!$C$15","v":0},{"$f":"D576*Impostos!$C$16","v":0},{"$f":"D576*Impostos!$C$17","v":0},{"$f":"D576*Impostos!$C$18","v":0},{"$f":"D576*Impostos!$C$19","v":0},0,0,null,null,""]
[null,null,null,null,{"$f":"D577*Impostos!$C$15","v":0},{"$f":"D577*Impostos!$C$16","v":0},{"$f":"D577*Impostos!$C$17","v":0},{"$f":"D577*Impostos!$C$18","v":0},{"$f":"D577*Impostos!$C$19","v":0},0,0,null,null,""]
[null,null,null,null,{"$f":"D578*Impostos!$C$15","v":0},{"$f":"D578*Impostos!$C$16","v":0},{"$f":"D578*Impostos!$C$17","v":0},{"$f":"D578*Impostos!$C$18","v":0},{"$f":"D578*Impostos!$C$19","v":0},0,0,null,null,""]
[null,null,null,null,{"$f":"D579*Impostos!$C$15","v":0},{"$f":"D579*Impostos!$C$16","v":0},{"$f":"D579*Impostos!$C$17","v":0},{"$f":"D579*Impostos!$C$18","v":0},{"$f":"D579*Impostos!$C$19","v":0},0,0,null,null,""]
[null,null,null,null,{"$f":"D580*Impostos!$C$15","v":0},{"$f":"D580*Impostos!$C$16","v":0},{"$f":"D580*Impostos!$C$17","v":0},{"$f":"D580*Impostos!$C$18","v":0},{"$f":"D580*Impostos!$C$19","v":0},0,0,null,null,""]
[null,null,null,null,{"$f":"D581*Impostos!$C$15","v":0},{"$f":"D581*Impostos!$C$16","v":0},{"$f":"D581*Impostos!$C$17","v":0},{"$f":"D581*Impostos!$C$18","v":0},{"$f":"D581*Impostos!$C$19","v":0},0,0,null,null,""]
[null,null,null,null,{"$f":"D582*Impostos!$C$15","v":0},{"$f":"D582*Impostos!$C$16","v":0},{"$f":"D582*Impostos!$C$17","v":0},{"$f":"D582*Impostos!$C$18","v":0},{"$f":"D582*Impostos!$C$19","v":0},0,0,null,null,""]
[null,null,null,null,{"$f":"D583*Impostos!$C$15","v":0},{"$f":"D583*Impostos!$C$16","v":0},{"$f":"D583*Impostos!$C$17","v":0},{"$f":"D583*Impostos!$C$18","v":0},{"$f":"D583*Impostos!$C$19","v":0},0,0,null,null,""]
[null,null,null,null,{"$f":"D584*Impostos!$C$15","v":0},{"$f":"D584*Impostos!$C$16","v":0},{"$f":"D584*Impostos!$C$17","v":0},{"$f":"D584*Impostos!$C$18","v":0},{"$f":"D584*Impostos!$C$19","v":0},0,0,null,null,""]
[null,null,null,null,{"$f":"D585*Impostos!$C$15","v":0},{"$f":"D585*Impostos!$C$16","v":0},{"$f":"D585*Impostos!$C$17","v":0},{"$f":"D585*Impostos!$C$18","v":0},{"$f":"D585*Impostos!$C$19","v":0},0,0,null,null,""]
[null,null,null,null,{"$f":"D586*Impostos!$C$15","v":0},{"$f":"D586*Impostos!$C$16","v":0},{"$f":"D586*Impostos!$C$17","v":0},{"$f":"D586*Impostos!$C$18","v":0},{"$f":"D586*Impostos!$C$19","v":0},0,0,null,null,""]
[null,null,null,null,{"$f":"D587*Impostos!$C$15","v":0},{"$f":"D587*Impostos!$C$16","v":0},{"$f":"D587*Impostos!$C$17","v":0},{"$f":"D587*Impostos!$C$18","v":0},{"$f":"D587*Impostos!$C$19","v":0},0,0,null,null,""]
[null,null,null,null,{"$f":"D588*Impostos!$C$15","v":0},{"$f":"D588*Impostos!$C$16","v":0},{"$f":"D588*Impostos!$C$17","v":0},{"$f":"D588*Impostos!$C$18","v":0},{"$f":"D588*Impostos!$C$19","v":0},0,0,null,null,""]
[null,null,null,null,{"$f":"D589*Impostos!$C$15","v":0},{"$f":"D589*Impostos!$C$16","v":0},{"$f":"D589*Impostos!$C$17","v":0},{"$f":"D589*Impostos!$C$18","v":0},{"$f":"D589*Impostos!$C$19","v":0},0,0,null,null,""]
[null,null,null,null,{"$f":"D590*Impostos!$C$15","v":0},{"$f":"D590*Impostos!$C$16","v":0},{"$f":"D590*Impostos!$C$17","v":0},{"$f":"D590*Impostos!$C$18","v":0},{"$f":"D590*Impostos!$C$19","v":0},0,0,null,null,""]
[null,null,null,null,{"$f":"D591*Impostos!$C$15","v":0},{"$f":"D591*Impostos!$C$16","v":0},{"$f":"D591*Impostos!$C$17","v":0},{"$f":"D591*Impostos!$C$18","v":0},{"$f":"D591*Impostos!$C$19","v":0},0,0,null,null,""]
[null,null,null,null,{"$f":"D592*Impostos!$C$15","v":0},{"$f":"D592*Impostos!$C$16","v":0},{"$f":"D592*Impostos!$C$17","v":0},{"$f":"D592*Impostos!$C$18","v":0},{"$f":"D592*Impostos!$C$19","v":0},0,0,null,null,{"$f":"IF(C592=\"\",\"\",MONTH(C592))","v":""}]
[null,null,null,null,{"$f":"D593*Impostos!$C$15","v":0},{"$f":"D593*Impostos!$C$16","v":0},{"$f":"D593*Impostos!$C$17","v":0},{"$f":"D593*Impostos!$C$18","v":0},{"$f":"D593*Impostos!$C$19","v":0},0,0,null,null,""]
[null,null,null,null,{"$f":"D594*Impostos!$C$15","v":0},{"$f":"D594*Impostos!$C$16","v":0},{"$f":"D594*Impostos!$C$17","v":0},{"$f":"D594*Impostos!$C$18","v":0},{"$f":"D594*Impostos!$C$19","v":0},0,0,null,null,""]
[null,null,null,null,{"$f":"D595*Impostos!$C$15","v":0},{"$f":"D595*Impostos!$C$16","v":0},{"$f":"D595*Impostos!$C$17","v":0},{"$f":"D595*Impostos!$C$18","v":0},{"$f":"D595*Impostos!$C$19","v":0},0,0,null,null,""]
[null,null,null,null,{"$f":"D596*Impostos!$C$15","v":0},{"$f":"D596*Impostos!$C$16","v":0},{"$f":"D596*Impostos!$C$17","v":0},{"$f":"D596*Impostos!$C$18","v":0},{"$f":"D596*Impostos!$C$19","v":0},0,0,null,null,""]
[null,null,null,null,{"$f":"D597*Impostos!$C$15","v":0},{"$f":"D597*Impostos!$C$16","v":0},{"$f":"D597*Impostos!$C$17","v":0},{"$f":"D597*Impostos!$C$18","v":0},{"$f":"D597*Impostos!$C$19","v":0},0,0,null,null,""]
[null,null,null,null,{"$f":"D598*Impostos!$C$15","v":0},{"$f":"D598*Impostos!$C$16","v":0},{"$f":"D598*Impostos!$C$17","v":0},{"$f":"D598*Impostos!$C$18","v":0},{"$f":"D598*Impostos!$C$19","v":0},0,0,null,null,""]
[null,null,null,null,{"$f":"D599*Impostos!$C$15","v":0},{"$f":"D599*Impostos!$C$16","v":0},{"$f":"D599*Impostos!$C$17","v":0},{"$f":"D599*Impostos!$C$18","v":0},{"$f":"D599*Impostos!$C$19","v":0},0,0,null,null,""]
[null,null,null,null,{"$f":"D600*Impostos!$C$15","v":0},{"$f":"D600*Impostos!$C$16","v":0},{"$f":"D600*Impostos!$C$17","v":0},{"$f":"D600*Impostos!$C$18","v":0},{"$f":"D600*Impostos!$C$19","v":0},{"$f":"SUM(E600:I600)","v":0},{"$f":"D600-J600","v":0},null,null,""]
[null,null,null,null,{"$f":"D601*Impostos!$C$15","v":0},{"$f":"D601*Impostos!$C$16","v":0},{"$f":"D601*Impostos!$C$17","v":0},{"$f":"D601*Impostos!$C$18","v":0},{"$f":"D601*Impostos!$C$19","v":0},0,0,null,null,""]
[null,null,null,null,{"$f":"D602*Impostos!$C$15","v":0},{"$f":"D602*Impostos!$C$16","v":0},{"$f":"D602*Impostos!$C$17","v":0},{"$f":"D602*Impostos!$C$18","v":0},{"$f":"D602*Impostos!$C$19","v":0},0,0,null,null,""]
[null,null,null,null,{"$f":"D603*Impostos!$C$15","v":0},{"$f":"D603*Impostos!$C$16","v":0},{"$f":"D603*Impostos!$C$17","v":0},{"$f":"D603*Impostos!$C$18","v":0},{"$f":"D603*Impostos!$C$19","v":0},0,0,null,null,""]
[null,null,null,null,{"$f":"D604*Impostos!$C$15","v":0},{"$f":"D604*Impostos!$C$16","v":0},{"$f":"D604*Impostos!$C$17","v":0},{"$f":"D604*Impostos!$C$18","v":0},{"$f":"D604*Impostos!$C$19","v":0},0,0,null,null,""]
[null,null,null,null,{"$f":"D605*Impostos!$C$15","v":0},{"$f":"D605*Impostos!$C$16","v":0},{"$f":"D605*Impostos!$C$17","v":0},{"$f":"D605*Impostos!$C$18","v":0},{"$f":"D605*Impostos!$C$19","v":0},0,0,null,null,""]
[null,null,null,null,{"$f":"D606*Impostos!$C$15","v":0},{"$f":"D606*Impostos!$C$16","v":0},{"$f":"D606*Impostos!$C$17","v":0},{"$f":"D606*Impostos!$C$18","v":0},{"$f":"D606*Impostos!$C$19","v":0},0,0,null,null,""]
[null,null,null,null,{"$f":"D607*Impostos!$C$15","v":0},{"$f":"D607*Impostos!$C$16","v":0},{"$f":"D607*Impostos!$C$17","v":0},{"$f":"D607*Impostos!$C$18","v":0},{"$f":"D607*Impostos!$C$19","v":0},0,0,null,null,""]
[null,null,null,null,{"$f":"D608*Impostos!$C$15","v":0},{"$f":"D608*Impostos!$C$16","v":0},{"$f":"D608*Impostos!$C$17","v":0},{"$f":"D608*Impostos!$C$18","v":0},{"$f":"D608*Impostos!$C$19","v":0},0,0,null,null,""]
[null,null,null,null,{"$f":"D609*Impostos!$C$15","v":0},{"$f":"D609*Impostos!$C$16","v":0},{"$f":"D609*Impostos!$C$17","v":0},{"$f":"D609*Impostos!$C$18","v":0},{"$f":"D609*Impostos!$C$19","v":0},0,0,null,null,""]
[null,null,null,null,{"$f":"D610*Impostos!$C$15","v":0},{"$f":"D610*Impostos!$C$16","v":0},{"$f":"D610*Impostos!$C$17","v":0},{"$f":"D610*Impostos!$C$18","v":0},{"$f":"D610*Impostos!$C$19","v":0},0,0,null,null,""]
[null,null,null,null,{"$f":"D611*Impostos!$C$15","v":0},{"$f":"D611*Impostos!$C$16","v":0},{"$f":"D611*Impostos!$C$17","v":0},{"$f":"D611*Impostos!$C$18","v":0},{"$f":"D611*Impostos!$C$19","v":0},0,0,null,null,""]
[null,null,null,null,{"$f":"D612*Impostos!$C$15","v":0},{"$f":"D612*Impostos!$C$16","v":0},{"$f":"D612*Impostos!$C$17","v":0},{"$f":"D612*Impostos!$C$18","v":0},{"$f":"D612*Impostos!$C$19","v":0},0,0,null,null,""]
[null,null,null,null,{"$f":"D613*Impostos!$C$15","v":0},{"$f":"D613*Impostos!$C$16","v":0},{"$f":"D613*Impostos!$C$17","v":0},{"$f":"D613*Impostos!$C$18","v":0},{"$f":"D613*Impostos!$C$19","v":0},0,0,null,null,""]
[null,null,null,null,{"$f":"D614*Impostos!$C$15","v":0},{"$f":"D614*Impostos!$C$16","v":0},{"$f":"D614*Impostos!$C$17","v":0},{"$f":"D614*Impostos!$C$18","v":0},{"$f":"D614*Impostos!$C$19","v":0},0,0,null,null,""]
[null,null,null,null,{"$f":"D615*Impostos!$C$15","v":0},{"$f":"D615*Impostos!$C$16","v":0},{"$f":"D615*Impostos!$C$17","v":0},{"$f":"D615*Impostos!$C$18","v":0},{"$f":"D615*Impostos!$C$19","v":0},0,0,null,null,""]
[null,null,null,null,{"$f":"D616*Impostos!$C$15","v":0},{"$f":"D616*Impostos!$C$16","v":0},{"$f":"D616*Impostos!$C$17","v":0},{"$f":"D616*Impostos!$C$18","v":0},{"$f":"D616*Impostos!$C$19","v":0},0,0,null,null,""]
[null,null,null,null,{"$f":"D617*Impostos!$C$15","v":0},{"$f":"D617*Impostos!$C$16","v":0},{"$f":"D617*Impostos!$C$17","v":0},{"$f":"D617*Impostos!$C$18","v":0},{"$f":"D617*Impostos!$C$19","v":0},0,0,null,null,""]
[null,null,null,null,{"$f":"D618*Impostos!$C$15","v":0},{"$f":"D618*Impostos!$C$16","v":0},{"$f":"D618*Impostos!$C$17","v":0},{"$f":"D618*Impostos!$C$18","v":0},{"$f":"D618*Impostos!$C$19","v":0},0,0,null,null,""]
[null,null,null,null,{"$f":"D619*Impostos!$C$15","v":0},{"$f":"D619*Impostos!$C$16","v":0},{"$f":"D619*Impostos!$C$17","v":0},{"$f":"D619*Impostos!$C$18","v":0},{"$f":"D619*Impostos!$C$19","v":0},0,0,null,null,""]
[null,null,null,null,{"$f":"D620*Impostos!$C$15","v":0},{"$f":"D620*Impostos!$C$16","v":0},{"$f":"D620*Impostos!$C$17","v":0},{"$f":"D620*Impostos!$C$18","v":0},{"$f":"D620*Impostos!$C$19","v":0},0,0,null,null,""]
[null,null,null,null,{"$f":"D621*Impostos!$C$15","v":0},{"$f":"D621*Impostos!$C$16","v":0},{"$f":"D621*Impostos!$C$17","v":0},{"$f":"D621*Impostos!$C$18","v":0},{"$f":"D621*Impostos!$C$19","v":0},0,0,null,null,""]
[null,null,null,null,{"$f":"D622*Impostos!$C$15","v":0},{"$f":"D622*Impostos!$C$16","v":0},{"$f":"D622*Impostos!$C$17","v":0},{"$f":"D622*Impostos!$C$18","v":0},{"$f":"D622*Impostos!$C$19","v":0},0,0,null,null,""]
[null,null,null,null,{"$f":"D623*Impostos!$C$15","v":0},{"$f":"D623*Impostos!$C$16","v":0},{"$f":"D623*Impostos!$C$17","v":0},{"$f":"D623*Impostos!$C$18","v":0},{"$f":"D623*Impostos!$C$19","v":0},0,0,null,null,""]
[null,null,null,null,{"$f":"D624*Impostos!$C$15","v":0},{"$f":"D624*Impostos!$C$16","v":0},{"$f":"D624*Impostos!$C$17","v":0},{"$f":"D624*Impostos!$C$18","v":0},{"$f":"D624*Impostos!$C$19","v":0},0,0,null,null,""]
[null,null,null,null,{"$f":"D625*Impostos!$C$15","v":0},{"$f":"D625*Impostos!$C$16","v":0},{"$f":"D625*Impostos!$C$17","v":0},{"$f":"D625*Impostos!$C$18","v":0},{"$f":"D625*Impostos!$C$19","v":0},0,0,null,null,""]
[null,null,null,null,{"$f":"D626*Impostos!$C$15","v":0},{"$f":"D626*Impostos!$C$16","v":0},{"$f":"D626*Impostos!$C$17","v":0},{"$f":"D626*Impostos!$C$18","v":0},{"$f":"D626*Impostos!$C$19","v":0},0,0,null,null,""]
[null,null,null,null,{"$f":"D627*Impostos!$C$15","v":0},{"$f":"D627*Impostos!$C$16","v":0},{"$f":"D627*Impostos!$C$17","v":0},{"$f":"D627*Impostos!$C$18","v":0},{"$f":"D627*Impostos!$C$19","v":0},0,0,null,null,""]
[null,null,null,null,{"$f":"D628*Impostos!$C$15","v":0},{"$f":"D628*Impostos!$C$16","v":0},{"$f":"D628*Impostos!$C$17","v":0},{"$f":"D628*Impostos!$C$18","v":0},{"$f":"D628*Impostos!$C$19","v":0},0,0,null,null,""]
[null,null,null,null,{"$f":"D629*Impostos!$C$15","v":0},{"$f":"D629*Impostos!$C$16","v":0},{"$f":"D629*Impostos!$C$17","v":0},{"$f":"D629*Impostos!$C$18","v":0},{"$f":"D629*Impostos!$C$19","v":0},0,0,null,null,""]
[null,null,null,null,{"$f":"D630*Impostos!$C$15","v":0},{"$f":"D630*Impostos!$C$16","v":0},{"$f":"D630*Impostos!$C$17","v":0},{"$f":"D630*Impostos!$C$18","v":0},{"$f":"D630*Impostos!$C$19","v":0},0,0,null,null,""]
[null,null,null,null,{"$f":"D631*Impostos!$C$15","v":0},{"$f":"D631*Impostos!$C$16","v":0},{"$f":"D631*Impostos!$C$17","v":0},{"$f":"D631*Impostos!$C$18","v":0},{"$f":"D631*Impostos!$C$19","v":0},0,0,null,null,""]
[null,null,null,null,{"$f":"D632*Impostos!$C$15","v":0},{"$f":"D632*Impostos!$C$16","v":0},{"$f":"D632*Impostos!$C$17","v":0},{"$f":"D632*Impostos!$C$18","v":0},{"$f":"D632*Impostos!$C$19","v":0},0,0,null,null,""]
[null,null,null,null,{"$f":"D633*Impostos!$C$15","v":0},{"$f":"D633*Impostos!$C$16","v":0},{"$f":"D633*Impostos!$C$17","v":0},{"$f":"D633*Impostos!$C$18","v":0},{"$f":"D633*Impostos!$C$19","v":0},0,0,null,null,""]
[null,null,null,null,{"$f":"D634*Impostos!$C$15","v":0},{"$f":"D634*Impostos!$C$16","v":0},{"$f":"D634*Impostos!$C$17","v":0},{"$f":"D634*Impostos!$C$18","v":0},{"$f":"D634*Impostos!$C$19","v":0},0,0,null,null,""]
[null,null,null,null,{"$f":"D635*Impostos!$C$15","v":0},{"$f":"D635*Impostos!$C$16","v":0},{"$f":"D635*Impostos!$C$17","v":0},{"$f":"D635*Impostos!$C$18","v":0},{"$f":"D635*Impostos!$C$19","v":0},0,0,null,null,""]
[null,null,null,null,{"$f":"D636*Impostos!$C$15","v":0},{"$f":"D636*Impostos!$C$16","v":0},{"$f":"D636*Impostos!$C$17","v":0},{"$f":"D636*Impostos!$C$18","v":0},{"$f":"D636*Impostos!$C$19","v":0},0,0,null,null,""]
[null,null,null,null,{"$f":"D637*Impostos!$C$15","v":0},{"$f":"D637*Impostos!$C$16","v":0},{"$f":"D637*Impostos!$C$17","v":0},{"$f":"D637*Impostos!$C$18","v":0},{"$f":"D637*Impostos!$C$19","v":0},0,0,null,null,""]
[null,null,null,null,{"$f":"D638*Impostos!$C$15","v":0},{"$f":"D638*Impostos!$C$16","v":0},{"$f":"D638*Impostos!$C$17","v":0},{"$f":"D638*Impostos!$C$18","v":0},{"$f":"D638*Impostos!$C$19","v":0},0,0,null,null,""]
[null,null,null,null,{"$f":"D639*Impostos!$C$15","v":0},{"$f":"D639*Impostos!$C$16","v":0},{"$f":"D639*Impostos!$C$17","v":0},{"$f":"D639*Impostos!$C$18","v":0},{"$f":"D639*Impostos!$C$19","v":0},0,0,null,null,""]
[null,null,null,null,{"$f":"D640*Impostos!$C$15","v":0},{"$f":"D640*Impostos!$C$16","v":0},{"$f":"D640*Impostos!$C$17","v":0},{"$f":"D640*Impostos!$C$18","v":0},{"$f":"D640*Impostos!$C$19","v":0},0,0,null,null,""]
[null,null,null,null,{"$f":"D641*Impostos!$C$15","v":0},{"$f":"D641*Impostos!$C$16","v":0},{"$f":"D641*Impostos!$C$17","v":0},{"$f":"D641*Impostos!$C$18","v":0},{"$f":"D641*Impostos!$C$19","v":0},0,0,null,null,""]
[null,null,null,null,{"$f":"D642*Impostos!$C$15","v":0},{"$f":"D642*Impostos!$C$16","v":0},{"$f":"D642*Impostos!$C$17","v":0},{"$f":"D642*Impostos!$C$18","v":0},{"$f":"D642*Impostos!$C$19","v":0},0,0,null,null,""]
[null,null,null,null,{"$f":"D643*Impostos!$C$15","v":0},{"$f":"D643*Impostos!$C$16","v":0},{"$f":"D643*Impostos!$C$17","v":0},{"$f":"D643*Impostos!$C$18","v":0},{"$f":"D643*Impostos!$C$19","v":0},0,0,null,null,""]
[null,null,null,null,{"$f":"D644*Impostos!$C$15","v":0},{"$f":"D644*Impostos!$C$16","v":0},{"$f":"D644*Impostos!$C$17","v":0},{"$f":"D644*Impostos!$C$18","v":0},{"$f":"D644*Impostos!$C$19","v":0},0,0,null,null,""]
[null,null,null,null,{"$f":"D645*Impostos!$C$15","v":0},{"$f":"D645*Impostos!$C$16","v":0},{"$f":"D645*Impostos!$C$17","v":0},{"$f":"D645*Impostos!$C$18","v":0},{"$f":"D645*Impostos!$C$19","v":0},0,0,null,null,""]
[null,null,null,null,{"$f":"D646*Impostos!$C$15","v":0},{"$f":"D646*Impostos!$C$16","v":0},{"$f":"D646*Impostos!$C$17","v":0},{"$f":"D646*Impostos!$C$18","v":0},{"$f":"D646*Impostos!$C$19","v":0},0,0,null,null,""]
[null,null,null,null,{"$f":"D647*Impostos!$C$15","v":0},{"$f":"D647*Impostos!$C$16","v":0},{"$f":"D647*Impostos!$C$17","v":0},{"$f":"D647*Impostos!$C$18","v":0},{"$f":"D647*Impostos!$C$19","v":0},0,0,null,null,""]
[null,null,null,null,{"$f":"D648*Impostos!$C$15","v":0},{"$f":"D648*Impostos!$C$16","v":0},{"$f":"D648*Impostos!$C$17","v":0},{"$f":"D648*Impostos!$C$18","v":0},{"$f":"D648*Impostos!$C$19","v":0},0,0,null,null,""]
[null,null,null,null,{"$f":"D649*Impostos!$C$15","v":0},{"$f":"D649*Impostos!$C$16","v":0},{"$f":"D649*Impostos!$C$17","v":0},{"$f":"D649*Impostos!$C$18","v":0},{"$f":"D649*Impostos!$C$19","v":0},0,0,null,null,""]
[null,null,null,null,{"$f":"D650*Impostos!$C$15","v":0},{"$f":"D650*Impostos!$C$16","v":0},{"$f":"D650*Impostos!$C$17","v":0},{"$f":"D650*Impostos!$C$18","v":0},{"$f":"D650*Impostos!$C$19","v":0},0,0,null,null,""]
[null,null,null,null,{"$f":"D651*Impostos!$C$15","v":0},{"$f":"D651*Impostos!$C$16","v":0},{"$f":"D651*Impostos!$C$17","v":0},{"$f":"D651*Impostos!$C$18","v":0},{"$f":"D651*Impostos!$C$19","v":0},0,0,null,null,""]
[null,null,null,null,{"$f":"D652*Impostos!$C$15","v":0},{"$f":"D652*Impostos!$C$16","v":0},{"$f":"D652*Impostos!$C$17","v":0},{"$f":"D652*Impostos!$C$18","v":0},{"$f":"D652*Impostos!$C$19","v":0},0,0,null,null,""]
[null,null,null,null,{"$f":"D653*Impostos!$C$15","v":0},{"$f":"D653*Impostos!$C$16","v":0},{"$f":"D653*Impostos!$C$17","v":0},{"$f":"D653*Impostos!$C$18","v":0},{"$f":"D653*Impostos!$C$19","v":0},0,0,null,null,""]
[null,null,null,null,{"$f":"D654*Impostos!$C$15","v":0},{"$f":"D654*Impostos!$C$16","v":0},{"$f":"D654*Impostos!$C$17","v":0},{"$f":"D654*Impostos!$C$18","v":0},{"$f":"D654*Impostos!$C$19","v":0},0,0,null,null,""]
[null,null,null,null,{"$f":"D655*Impostos!$C$15","v":0},{"$f":"D655*Impostos!$C$16","v":0},{"$f":"D655*Impostos!$C$17","v":0},{"$f":"D655*Impostos!$C$18","v":0},{"$f":"D655*Impostos!$C$19","v":0},0,0,null,null,""]
[null,null,null,null,{"$f":"D656*Impostos!$C$15","v":0},{"$f":"D656*Impostos!$C$16","v":0},{"$f":"D656*Impostos!$C$17","v":0},{"$f":"D656*Impostos!$C$18","v":0},{"$f":"D656*Impostos!$C$19","v":0},0,0,null,null,{"$f":"IF(C656=\"\",\"\",MONTH(C656))","v":""}]
[null,null,null,null,{"$f":"D657*Impostos!$C$15","v":0},{"$f":"D657*Impostos!$C$16","v":0},{"$f":"D657*Impostos!$C$17","v":0},{"$f":"D657*Impostos!$C$18","v":0},{"$f":"D657*Impostos!$C$19","v":0},0,0,null,null,""]
[null,null,null,null,{"$f":"D658*Impostos!$C$15","v":0},{"$f":"D658*Impostos!$C$16","v":0},{"$f":"D658*Impostos!$C$17","v":0},{"$f":"D658*Impostos!$C$18","v":0},{"$f":"D658*Impostos!$C$19","v":0},0,0,null,null,""]
[null,null,null,null,{"$f":"D659*Impostos!$C$15","v":0},{"$f":"D659*Impostos!$C$16","v":0},{"$f":"D659*Impostos!$C$17","v":0},{"$f":"D659*Impostos!$C$18","v":0},{"$f":"D659*Impostos!$C$19","v":0},0,0,null,null,""]
[null,null,null,null,{"$f":"D660*Impostos!$C$15","v":0},{"$f":"D660*Impostos!$C$16","v":0},{"$f":"D660*Impostos!$C$17","v":0},{"$f":"D660*Impostos!$C$18","v":0},{"$f":"D660*Impostos!$C$19","v":0},0,0,null,null,""]
[null,null,null,null,{"$f":"D661*Impostos!$C$15","v":0},{"$f":"D661*Impostos!$C$16","v":0},{"$f":"D661*Impostos!$C$17","v":0},{"$f":"D661*Impostos!$C$18","v":0},{"$f":"D661*Impostos!$C$19","v":0},0,0,null,null,""]
[null,null,null,null,{"$f":"D662*Impostos!$C$15","v":0},{"$f":"D662*Impostos!$C$16","v":0},{"$f":"D662*Impostos!$C$17","v":0},{"$f":"D662*Impostos!$C$18","v":0},{"$f":"D662*Impostos!$C$19","v":0},0,0,null,null,""]
[null,null,null,null,{"$f":"D663*Impostos!$C$15","v":0},{"$f":"D663*Impostos!$C$16","v":0},{"$f":"D663*Impostos!$C$17","v":0},{"$f":"D663*Impostos!$C$18","v":0},{"$f":"D663*Impostos!$C$19","v":0},0,0,null,null,""]
[null,null,null,null,{"$f":"D664*Impostos!$C$15","v":0},{"$f":"D664*Impostos!$C$16","v":0},{"$f":"D664*Impostos!$C$17","v":0},{"$f":"D664*Impostos!$C$18","v":0},{"$f":"D664*Impostos!$C$19","v":0},{"$f":"SUM(E664:I664)","v":0},{"$f":"D664-J664","v":0},null,null,""]
[null,null,null,null,{"$f":"D665*Impostos!$C$15","v":0},{"$f":"D665*Impostos!$C$16","v":0},{"$f":"D665*Impostos!$C$17","v":0},{"$f":"D665*Impostos!$C$18","v":0},{"$f":"D665*Impostos!$C$19","v":0},0,0,null,null,""]
[null,null,null,null,{"$f":"D666*Impostos!$C$15","v":0},{"$f":"D666*Impostos!$C$16","v":0},{"$f":"D666*Impostos!$C$17","v":0},{"$f":"D666*Impostos!$C$18","v":0},{"$f":"D666*Impostos!$C$19","v":0},0,0,null,null,""]
[null,null,null,null,{"$f":"D667*Impostos!$C$15","v":0},{"$f":"D667*Impostos!$C$16","v":0},{"$f":"D667*Impostos!$C$17","v":0},{"$f":"D667*Impostos!$C$18","v":0},{"$f":"D667*Impostos!$C$19","v":0},0,0,null,null,""]
[null,null,null,null,{"$f":"D668*Impostos!$C$15","v":0},{"$f":"D668*Impostos!$C$16","v":0},{"$f":"D668*Impostos!$C$17","v":0},{"$f":"D668*Impostos!$C$18","v":0},{"$f":"D668*Impostos!$C$19","v":0},0,0,null,null,""]
[null,null,null,null,{"$f":"D669*Impostos!$C$15","v":0},{"$f":"D669*Impostos!$C$16","v":0},{"$f":"D669*Impostos!$C$17","v":0},{"$f":"D669*Impostos!$C$18","v":0},{"$f":"D669*Impostos!$C$19","v":0},0,0,null,null,""]
[null,null,null,null,{"$f":"D670*Impostos!$C$15","v":0},{"$f":"D670*Impostos!$C$16","v":0},{"$f":"D670*Impostos!$C$17","v":0},{"$f":"D670*Impostos!$C$18","v":0},{"$f":"D670*Impostos!$C$19","v":0},0,0,null,null,""]
[null,null,null,null,{"$f":"D671*Impostos!$C$15","v":0},{"$f":"D671*Impostos!$C$16","v":0},{"$f":"D671*Impostos!$C$17","v":0},{"$f":"D671*Impostos!$C$18","v":0},{"$f":"D671*Impostos!$C$19","v":0},0,0,null,null,""]
[null,null,null,null,{"$f":"D672*Impostos!$C$15","v":0},{"$f":"D672*Impostos!$C$16","v":0},{"$f":"D672*Impostos!$C$17","v":0},{"$f":"D672*Impostos!$C$18","v":0},{"$f":"D672*Impostos!$C$19","v":0},0,0,null,null,""]
[null,null,null,null,{"$f":"D673*Impostos!$C$15","v":0},{"$f":"D673*Impostos!$C$16","v":0},{"$f":"D673*Impostos!$C$17","v":0},{"$f":"D673*Impostos!$C$18","v":0},{"$f":"D673*Impostos!$C$19","v":0},0,0,null,null,""]
[null,null,null,null,{"$f":"D674*Impostos!$C$15","v":0},{"$f":"D674*Impostos!$C$16","v":0},{"$f":"D674*Impostos!$C$17","v":0},{"$f":"D674*Impostos!$C$18","v":0},{"$f":"D674*Impostos!$C$19","v":0},0,0,null,null,""]
[null,null,null,null,{"$f":"D675*Impostos!$C$15","v":0},{"$f":"D675*Impostos!$C$16","v":0},{"$f":"D675*Impostos!$C$17","v":0},{"$f":"D675*Impostos!$C$18","v":0},{"$f":"D675*Impostos!$C$19","v":0},0,0,null,null,""]
[null,null,null,null,{"$f":"D676*Impostos!$C$15","v":0},{"$f":"D676*Impostos!$C$16","v":0},{"$f":"D676*Impostos!$C$17","v":0},{"$f":"D676*Impostos!$C$18","v":0},{"$f":"D676*Impostos!$C$19","v":0},0,0,null,null,""]
[null,null,null,null,{"$f":"D677*Impostos!$C$15","v":0},{"$f":"D677*Impostos!$C$16","v":0},{"$f":"D677*Impostos!$C$17","v":0},{"$f":"D677*Impostos!$C$18","v":0},{"$f":"D677*Impostos!$C$19","v":0},0,0,null,null,""]
[null,null,null,null,{"$f":"D678*Impostos!$C$15","v":0},{"$f":"D678*Impostos!$C$16","v":0},{"$f":"D678*Impostos!$C$17","v":0},{"$f":"D678*Impostos!$C$18","v":0},{"$f":"D678*Impostos!$C$19","v":0},0,0,null,null,""]
[null,null,null,null,{"$f":"D679*Impostos!$C$15","v":0},{"$f":"D679*Impostos!$C$16","v":0},{"$f":"D679*Impostos!$C$17","v":0},{"$f":"D679*Impostos!$C$18","v":0},{"$f":"D679*Impostos!$C$19","v":0},0,0,null,null,""]
[null,null,null,null,{"$f":"D680*Impostos!$C$15","v":0},{"$f":"D680*Impostos!$C$16","v":0},{"$f":"D680*Impostos!$C$17","v":0},{"$f":"D680*Impostos!$C$18","v":0},{"$f":"D680*Impostos!$C$19","v":0},0,0,null,null,""]
[null,null,null,null,{"$f":"D681*Impostos!$C$15","v":0},{"$f":"D681*Impostos!$C$16","v":0},{"$f":"D681*Impostos!$C$17","v":0},{"$f":"D681*Impostos!$C$18","v":0},{"$f":"D681*Impostos!$C$19","v":0},0,0,null,null,""]
[null,null,null,null,{"$f":"D682*Impostos!$C$15","v":0},{"$f":"D682*Impostos!$C$16","v":0},{"$f":"D682*Impostos!$C$17","v":0},{"$f":"D682*Impostos!$C$18","v":0},{"$f":"D682*Impostos!$C$19","v":0},0,0,null,null,""]
[null,null,null,null,{"$f":"D683*Impostos!$C$15","v":0},{"$f":"D683*Impostos!$C$16","v":0},{"$f":"D683*Impostos!$C$17","v":0},{"$f":"D683*Impostos!$C$18","v":0},{"$f":"D683*Impostos!$C$19","v":0},0,0,null,null,""]
[null,null,null,null,{"$f":"D684*Impostos!$C$15","v":0},{"$f":"D684*Impostos!$C$16","v":0},{"$f":"D684*Impostos!$C$17","v":0},{"$f":"D684*Impostos!$C$18","v":0},{"$f":"D684*Impostos!$C$19","v":0},0,0,null,null,""]
[null,null,null,null,{"$f":"D685*Impostos!$C$15","v":0},{"$f":"D685*Impostos!$C$16","v":0},{"$f":"D685*Impostos!$C$17","v":0},{"$f":"D685*Impostos!$C$18","v":0},{"$f":"D685*Impostos!$C$19","v":0},0,0,null,null,""]
[null,null,null,null,{"$f":"D686*Impostos!$C$15","v":0},{"$f":"D686*Impostos!$C$16","v":0},{"$f":"D686*Impostos!$C$17","v":0},{"$f":"D686*Impostos!$C$18","v":0},{"$f":"D686*Impostos!$C$19","v":0},0,0,null,null,""]
[null,null,null,null,{"$f":"D687*Impostos!$C$15","v":0},{"$f":"D687*Impostos!$C$16","v":0},{"$f":"D687*Impostos!$C$17","v":0},{"$f":"D687*Impostos!$C$18","v":0},{"$f":"D687*Impostos!$C$19","v":0},0,0,null,null,""]
[null,null,null,null,{"$f":"D688*Impostos!$C$15","v":0},{"$f":"D688*Impostos!$C$16","v":0},{"$f":"D688*Impostos!$C$17","v":0},{"$f":"D688*Impostos!$C$18","v":0},{"$f":"D688*Impostos!$C$19","v":0},0,0,null,null,""]
[null,null,null,null,{"$f":"D689*Impostos!$C$15","v":0},{"$f":"D689*Impostos!$C$16","v":0},{"$f":"D689*Impostos!$C$17","v":0},{"$f":"D689*Impostos!$C$18","v":0},{"$f":"D689*Impostos!$C$19","v":0},0,0,null,null,""]
[null,null,null,null,{"$f":"D690*Impostos!$C$15","v":0},{"$f":"D690*Impostos!$C$16","v":0},{"$f":"D690*Impostos!$C$17","v":0},{"$f":"D690*Impostos!$C$18","v":0},{"$f":"D690*Impostos!$C$19","v":0},0,0,null,null,""]
[null,null,null,null,{"$f":"D691*Impostos!$C$15","v":0},{"$f":"D691*Impostos!$C$16","v":0},{"$f":"D691*Impostos!$C$17","v":0},{"$f":"D691*Impostos!$C$18","v":0},{"$f":"D691*Impostos!$C$19","v":0},0,0,null,null,""]
[null,null,null,null,{"$f":"D692*Impostos!$C$15","v":0},{"$f":"D692*Impostos!$C$16","v":0},{"$f":"D692*Impostos!$C$17","v":0},{"$f":"D692*Impostos!$C$18","v":0},{"$f":"D692*Impostos!$C$19","v":0},0,0,null,null,""]
[null,null,null,null,{"$f":"D693*Impostos!$C$15","v":0},{"$f":"D693*Impostos!$C$16","v":0},{"$f":"D693*Impostos!$C$17","v":0},{"$f":"D693*Impostos!$C$18","v":0},{"$f":"D693*Impostos!$C$19","v":0},0,0,null,null,""]
[null,null,null,null,{"$f":"D694*Impostos!$C$15","v":0},{"$f":"D694*Impostos!$C$16","v":0},{"$f":"D694*Impostos!$C$17","v":0},{"$f":"D694*Impostos!$C$18","v":0},{"$f":"D694*Impostos!$C$19","v":0},0,0,null,null,""]
[null,null,null,null,{"$f":"D695*Impostos!$C$15","v":0},{"$f":"D695*Impostos!$C$16","v":0},{"$f":"D695*Impostos!$C$17","v":0},{"$f":"D695*Impostos!$C$18","v":0},{"$f":"D695*Impostos!$C$19","v":0},0,0,null,null,""]
[null,null,null,null,{"$f":"D696*Impostos!$C$15","v":0},{"$f":"D696*Impostos!$C$16","v":0},{"$f":"D696*Impostos!$C$17","v":0},{"$f":"D696*Impostos!$C$18","v":0},{"$f":"D696*Impostos!$C$19","v":0},0,0,null,null,""]
[null,null,null,null,{"$f":"D697*Impostos!$C$15","v":0},{"$f":"D697*Impostos!$C$16","v":0},{"$f":"D697*Impostos!$C$17","v":0},{"$f":"D697*Impostos!$C$18","v":0},{"$f":"D697*Impostos!$C$19","v":0},0,0,null,null,""]
[null,null,null,null,{"$f":"D698*Impostos!$C$15","v":0},{"$f":"D698*Impostos!$C$16","v":0},{"$f":"D698*Impostos!$C$17","v":0},{"$f":"D698*Impostos!$C$18","v":0},{"$f":"D698*Impostos!$C$19","v":0},0,0,null,null,""]
[null,null,null,null,{"$f":"D699*Impostos!$C$15","v":0},{"$f":"D699*Impostos!$C$16","v":0},{"$f":"D699*Impostos!$C$17","v":0},{"$f":"D699*Impostos!$C$18","v":0},{"$f":"D699*Impostos!$C$19","v":0},0,0,null,null,""]
[null,null,null,null,{"$f":"D700*Impostos!$C$15","v":0},{"$f":"D700*Impostos!$C$16","v":0},{"$f":"D700*Impostos!$C$17","v":0},{"$f":"D700*Impostos!$C$18","v":0},{"$f":"D700*Impostos!$C$19","v":0},0,0,null,null,""]
[null,null,null,null,{"$f":"D701*Impostos!$C$15","v":0},{"$f":"D701*Impostos!$C$16","v":0},{"$f":"D701*Impostos!$C$17","v":0},{"$f":"D701*Impostos!$C$18","v":0},{"$f":"D701*Impostos!$C$19","v":0},0,0,null,null,""]
[null,null,null,null,{"$f":"D702*Impostos!$C$15","v":0},{"$f":"D702*Impostos!$C$16","v":0},{"$f":"D702*Impostos!$C$17","v":0},{"$f":"D702*Impostos!$C$18","v":0},{"$f":"D702*Impostos!$C$19","v":0},0,0,null,null,""]
[null,null,null,null,{"$f":"D703*Impostos!$C$15","v":0},{"$f":"D703*Impostos!$C$16","v":0},{"$f":"D703*Impostos!$C$17","v":0},{"$f":"D703*Impostos!$C$18","v":0},{"$f":"D703*Impostos!$C$19","v":0},0,0,null,null,""]
[null,null,null,null,{"$f":"D704*Impostos!$C$15","v":0},{"$f":"D704*Impostos!$C$16","v":0},{"$f":"D704*Impostos!$C$17","v":0},{"$f":"D704*Impostos!$C$18","v":0},{"$f":"D704*Impostos!$C$19","v":0},0,0,null,null,""]
[null,null,null,null,{"$f":"D705*Impostos!$C$15","v":0},{"$f":"D705*Impostos!$C$16","v":0},{"$f":"D705*Impostos!$C$17","v":0},{"$f":"D705*Impostos!$C$18","v":0},{"$f":"D705*Impostos!$C$19","v":0},0,0,null,null,""]
[null,null,null,null,{"$f":"D706*Impostos!$C$15","v":0},{"$f":"D706*Impostos!$C$16","v":0},{"$f":"D706*Impostos!$C$17","v":0},{"$f":"D706*Impostos!$C$18","v":0},{"$f":"D706*Impostos!$C$19","v":0},0,0,null,null,""]
[null,null,null,null,{"$f":"D707*Impostos!$C$15","v":0},{"$f":"D707*Impostos!$C$16","v":0},{"$f":"D707*Impostos!$C$17","v":0},{"$f":"D707*Impostos!$C$18","v":0},{"$f":"D707*Impostos!$C$19","v":0},0,0,null,null,""]
[null,null,null,null,{"$f":"D708*Impostos!$C$15","v":0},{"$f":"D708*Impostos!$C$16","v":0},{"$f":"D708*Impostos!$C$17","v":0},{"$f":"D708*Impostos!$C$18","v":0},{"$f":"D708*Impostos!$C$19","v":0},0,0,null,null,""]
[null,null,null,null,{"$f":"D709*Impostos!$C$15","v":0},{"$f":"D709*Impostos!$C$16","v":0},{"$f":"D709*Impostos!$C$17","v":0},{"$f":"D709*Impostos!$C$18","v":0},{"$f":"D709*Impostos!$C$19","v":0},0,0,null,null,""]
[null,null,null,null,{"$f":"D710*Impostos!$C$15","v":0},{"$f":"D710*Impostos!$C$16","v":0},{"$f":"D710*Impostos!$C$17","v":0},{"$f":"D710*Impostos!$C$18","v":0},{"$f":"D710*Impostos!$C$19","v":0},0,0,null,null,""]
[null,null,null,null,{"$f":"D711*Impostos!$C$15","v":0},{"$f":"D711*Impostos!$C$16","v":0},{"$f":"D711*Impostos!$C$17","v":0},{"$f":"D711*Impostos!$C$18","v":0},{"$f":"D711*Impostos!$C$19","v":0},0,0,null,null,""]
[null,null,null,null,{"$f":"D712*Impostos!$C$15","v":0},{"$f":"D712*Impostos!$C$16","v":0},{"$f":"D712*Impostos!$C$17","v":0},{"$f":"D712*Impostos!$C$18","v":0},{"$f":"D712*Impostos!$C$19","v":0},0,0,null,null,""]
[null,null,null,null,{"$f":"D713*Impostos!$C$15","v":0},{"$f":"D713*Impostos!$C$16","v":0},{"$f":"D713*Impostos!$C$17","v":0},{"$f":"D713*Impostos!$C$18","v":0},{"$f":"D713*Impostos!$C$19","v":0},0,0,null,null,""]
[null,null,null,null,{"$f":"D714*Impostos!$C$15","v":0},{"$f":"D714*Impostos!$C$16","v":0},{"$f":"D714*Impostos!$C$17","v":0},{"$f":"D714*Impostos!$C$18","v":0},{"$f":"D714*Impostos!$C$19","v":0},0,0,null,null,""]
[null,null,null,null,{"$f":"D715*Impostos!$C$15","v":0},{"$f":"D715*Impostos!$C$16","v":0},{"$f":"D715*Impostos!$C$17","v":0},{"$f":"D715*Impostos!$C$18","v":0},{"$f":"D715*Impostos!$C$19","v":0},0,0,null,null,""]
[null,null,null,null,{"$f":"D716*Impostos!$C$15","v":0},{"$f":"D716*Impostos!$C$16","v":0},{"$f":"D716*Impostos!$C$17","v":0},{"$f":"D716*Impostos!$C$18","v":0},{"$f":"D716*Impostos!$C$19","v":0},0,0,null,null,""]
[null,null,null,null,{"$f":"D717*Impostos!$C$15","v":0},{"$f":"D717*Impostos!$C$16","v":0},{"$f":"D717*Impostos!$C$17","v":0},{"$f":"D717*Impostos!$C$18","v":0},{"$f":"D717*Impostos!$C$19","v":0},0,0,null,null,""]
[null,null,null,null,{"$f":"D718*Impostos!$C$15","v":0},{"$f":"D718*Impostos!$C$16","v":0},{"$f":"D718*Impostos!$C$17","v":0},{"$f":"D718*Impostos!$C$18","v":0},{"$f":"D718*Impostos!$C$19","v":0},0,0,null,null,""]
[null,null,null,null,{"$f":"D719*Impostos!$C$15","v":0},{"$f":"D719*Impostos!$C$16","v":0},{"$f":"D719*Impostos!$C$17","v":0},{"$f":"D719*Impostos!$C$18","v":0},{"$f":"D719*Impostos!$C$19","v":0},0,0,null,null,""]
[null,null,null,null,{"$f":"D720*Impostos!$C$15","v":0},{"$f":"D720*Impostos!$C$16","v":0},{"$f":"D720*Impostos!$C$17","v":0},{"$f":"D720*Impostos!$C$18","v":0},{"$f":"D720*Impostos!$C$19","v":0},0,0,null,null,{"$f":"IF(C720=\"\",\"\",MONTH(C720))","v":""}]
[null,null,null,null,{"$f":"D721*Impostos!$C$15","v":0},{"$f":"D721*Impostos!$C$16","v":0},{"$f":"D721*Impostos!$C$17","v":0},{"$f":"D721*Impostos!$C$18","v":0},{"$f":"D721*Impostos!$C$19","v":0},0,0,null,null,""]
[null,null,null,null,{"$f":"D722*Impostos!$C$15","v":0},{"$f":"D722*Impostos!$C$16","v":0},{"$f":"D722*Impostos!$C$17","v":0},{"$f":"D722*Impostos!$C$18","v":0},{"$f":"D722*Impostos!$C$19","v":0},0,0,null,null,""]
[null,null,null,null,{"$f":"D723*Impostos!$C$15","v":0},{"$f":"D723*Impostos!$C$16","v":0},{"$f":"D723*Impostos!$C$17","v":0},{"$f":"D723*Impostos!$C$18","v":0},{"$f":"D723*Impostos!$C$19","v":0},0,0,null,null,""]
[null,null,null,null,{"$f":"D724*Impostos!$C$15","v":0},{"$f":"D724*Impostos!$C$16","v":0},{"$f":"D724*Impostos!$C$17","v":0},{"$f":"D724*Impostos!$C$18","v":0},{"$f":"D724*Impostos!$C$19","v":0},0,0,null,null,""]
[null,null,null,null,{"$f":"D725*Impostos!$C$15","v":0},{"$f":"D725*Impostos!$C$16","v":0},{"$f":"D725*Impostos!$C$17","v":0},{"$f":"D725*Impostos!$C$18","v":0},{"$f":"D725*Impostos!$C$19","v":0},0,0,null,null,""]
[null,null,null,null,{"$f":"D726*Impostos!$C$15","v":0},{"$f":"D726*Impostos!$C$16","v":0},{"$f":"D726*Impostos!$C$17","v":0},{"$f":"D726*Impostos!$C$18","v":0},{"$f":"D726*Impostos!$C$19","v":0},0,0,null,null,""]
[null,null,null,null,{"$f":"D727*Impostos!$C$15","v":0},{"$f":"D727*Impostos!$C$16","v":0},{"$f":"D727*Impostos!$C$17","v":0},{"$f":"D727*Impostos!$C$18","v":0},{"$f":"D727*Impostos!$C$19","v":0},0,0,null,null,""]
[null,null,null,null,{"$f":"D728*Impostos!$C$15","v":0},{"$f":"D728*Impostos!$C$16","v":0},{"$f":"D728*Impostos!$C$17","v":0},{"$f":"D728*Impostos!$C$18","v":0},{"$f":"D728*Impostos!$C$19","v":0},{"$f":"SUM(E728:I728)","v":0},{"$f":"D728-J728","v":0},null,null,""]
[null,null,null,null,{"$f":"D729*Impostos!$C$15","v":0},{"$f":"D729*Impostos!$C$16","v":0},{"$f":"D729*Impostos!$C$17","v":0},{"$f":"D729*Impostos!$C$18","v":0},{"$f":"D729*Impostos!$C$19","v":0},0,0,null,null,""]
[null,null,null,null,{"$f":"D730*Impostos!$C$15","v":0},{"$f":"D730*Impostos!$C$16","v":0},{"$f":"D730*Impostos!$C$17","v":0},{"$f":"D730*Impostos!$C$18","v":0},{"$f":"D730*Impostos!$C$19","v":0},0,0,null,null,""]
[null,null,null,null,{"$f":"D731*Impostos!$C$15","v":0},{"$f":"D731*Impostos!$C$16","v":0},{"$f":"D731*Impostos!$C$17","v":0},{"$f":"D731*Impostos!$C$18","v":0},{"$f":"D731*Impostos!$C$19","v":0},0,0,null,null,""]
[null,null,null,null,{"$f":"D732*Impostos!$C$15","v":0},{"$f":"D732*Impostos!$C$16","v":0},{"$f":"D732*Impostos!$C$17","v":0},{"$f":"D732*Impostos!$C$18","v":0},{"$f":"D732*Impostos!$C$19","v":0},0,0,null,null,""]
[null,null,null,null,{"$f":"D733*Impostos!$C$15","v":0},{"$f":"D733*Impostos!$C$16","v":0},{"$f":"D733*Impostos!$C$17","v":0},{"$f":"D733*Impostos!$C$18","v":0},{"$f":"D733*Impostos!$C$19","v":0},0,0,null,null,""]
[null,null,null,null,{"$f":"D734*Impostos!$C$15","v":0},{"$f":"D734*Impostos!$C$16","v":0},{"$f":"D734*Impostos!$C$17","v":0},{"$f":"D734*Impostos!$C$18","v":0},{"$f":"D734*Impostos!$C$19","v":0},0,0,null,null,""]
[null,null,null,null,{"$f":"D735*Impostos!$C$15","v":0},{"$f":"D735*Impostos!$C$16","v":0},{"$f":"D735*Impostos!$C$17","v":0},{"$f":"D735*Impostos!$C$18","v":0},{"$f":"D735*Impostos!$C$19","v":0},0,0,null,null,""]
[null,null,null,null,{"$f":"D736*Impostos!$C$15","v":0},{"$f":"D736*Impostos!$C$16","v":0},{"$f":"D736*Impostos!$C$17","v":0},{"$f":"D736*Impostos!$C$18","v":0},{"$f":"D736*Impostos!$C$19","v":0},0,0,null,null,""]
[null,null,null,null,{"$f":"D737*Impostos!$C$15","v":0},{"$f":"D737*Impostos!$C$16","v":0},{"$f":"D737*Impostos!$C$17","v":0},{"$f":"D737*Impostos!$C$18","v":0},{"$f":"D737*Impostos!$C$19","v":0},0,0,null,null,""]
[null,null,null,null,{"$f":"D738*Impostos!$C$15","v":0},{"$f":"D738*Impostos!$C$16","v":0},{"$f":"D738*Impostos!$C$17","v":0},{"$f":"D738*Impostos!$C$18","v":0},{"$f":"D738*Impostos!$C$19","v":0},0,0,null,null,""]
[null,null,null,null,{"$f":"D739*Impostos!$C$15","v":0},{"$f":"D739*Impostos!$C$16","v":0},{"$f":"D739*Impostos!$C$17","v":0},{"$f":"D739*Impostos!$C$18","v":0},{"$f":"D739*Impostos!$C$19","v":0},0,0,null,null,""]
[null,null,null,null,{"$f":"D740*Impostos!$C$15","v":0},{"$f":"D740*Impostos!$C$16","v":0},{"$f":"D740*Impostos!$C$17","v":0},{"$f":"D740*Impostos!$C$18","v":0},{"$f":"D740*Impostos!$C$19","v":0},0,0,null,null,""]
[null,null,null,null,{"$f":"D741*Impostos!$C$15","v":0},{"$f":"D741*Impostos!$C$16","v":0},{"$f":"D741*Impostos!$C$17","v":0},{"$f":"D741*Impostos!$C$18","v":0},{"$f":"D741*Impostos!$C$19","v":0},0,0,null,null,""]
[null,null,null,null,{"$f":"D742*Impostos!$C$15","v":0},{"$f":"D742*Impostos!$C$16","v":0},{"$f":"D742*Impostos!$C$17","v":0},{"$f":"D742*Impostos!$C$18","v":0},{"$f":"D742*Impostos!$C$19","v":0},0,0,null,null,""]
[null,null,null,null,{"$f":"D743*Impostos!$C$15","v":0},{"$f":"D743*Impostos!$C$16","v":0},{"$f":"D743*Impostos!$C$17","v":0},{"$f":"D743*Impostos!$C$18","v":0},{"$f":"D743*Impostos!$C$19","v":0},0,0,null,null,""]
[null,null,null,null,{"$f":"D744*Impostos!$C$15","v":0},{"$f":"D744*Impostos!$C$16","v":0},{"$f":"D744*Impostos!$C$17","v":0},{"$f":"D744*Impostos!$C$18","v":0},{"$f":"D744*Impostos!$C$19","v":0},0,0,null,null,""]
[null,null,null,null,{"$f":"D745*Impostos!$C$15","v":0},{"$f":"D745*Impostos!$C$16","v":0},{"$f":"D745*Impostos!$C$17","v":0},{"$f":"D745*Impostos!$C$18","v":0},{"$f":"D745*Impostos!$C$19","v":0},0,0,null,null,""]
[null,null,null,null,{"$f":"D746*Impostos!$C$15","v":0},{"$f":"D746*Impostos!$C$16","v":0},{"$f":"D746*Impostos!$C$17","v":0},{"$f":"D746*Impostos!$C$18","v":0},{"$f":"D746*Impostos!$C$19","v":0},0,0,null,null,""]
[null,null,null,null,{"$f":"D747*Impostos!$C$15","v":0},{"$f":"D747*Impostos!$C$16","v":0},{"$f":"D747*Impostos!$C$17","v":0},{"$f":"D747*Impostos!$C$18","v":0},{"$f":"D747*Impostos!$C$19","v":0},0,0,null,null,""]
[null,null,null,null,{"$f":"D748*Impostos!$C$15","v":0},{"$f":"D748*Impostos!$C$16","v":0},{"$f":"D748*Impostos!$C$17","v":0},{"$f":"D748*Impostos!$C$18","v":0},{"$f":"D748*Impostos!$C$19","v":0},0,0,null,null,""]
[null,null,null,null,{"$f":"D749*Impostos!$C$15","v":0},{"$f":"D749*Impostos!$C$16","v":0},{"$f":"D749*Impostos!$C$17","v":0},{"$f":"D749*Impostos!$C$18","v":0},{"$f":"D749*Impostos!$C$19","v":0},0,0,null,null,""]
[null,null,null,null,{"$f":"D750*Impostos!$C$15","v":0},{"$f":"D750*Impostos!$C$16","v":0},{"$f":"D750*Impostos!$C$17","v":0},{"$f":"D750*Impostos!$C$18","v":0},{"$f":"D750*Impostos!$C$19","v":0},0,0,null,null,""]
[null,null,null,null,{"$f":"D751*Impostos!$C$15","v":0},{"$f":"D751*Impostos!$C$16","v":0},{"$f":"D751*Impostos!$C$17","v":0},{"$f":"D751*Impostos!$C$18","v":0},{"$f":"D751*Impostos!$C$19","v":0},0,0,null,null,""]
[null,null,null,null,{"$f":"D752*Impostos!$C$15","v":0},{"$f":"D752*Impostos!$C$16","v":0},{"$f":"D752*Impostos!$C$17","v":0},{"$f":"D752*Impostos!$C$18","v":0},{"$f":"D752*Impostos!$C$19","v":0},0,0,null,null,""]
[null,null,null,null,{"$f":"D753*Impostos!$C$15","v":0},{"$f":"D753*Impostos!$C$16","v":0},{"$f":"D753*Impostos!$C$17","v":0},{"$f":"D753*Impostos!$C$18","v":0},{"$f":"D753*Impostos!$C$19","v":0},0,0,null,null,""]
[null,null,null,null,{"$f":"D754*Impostos!$C$15","v":0},{"$f":"D754*Impostos!$C$16","v":0},{"$f":"D754*Impostos!$C$17","v":0},{"$f":"D754*Impostos!$C$18","v":0},{"$f":"D754*Impostos!$C$19","v":0},0,0,null,null,""]
[null,null,null,null,{"$f":"D755*Impostos!$C$15","v":0},{"$f":"D755*Impostos!$C$16","v":0},{"$f":"D755*Impostos!$C$17","v":0},{"$f":"D755*Impostos!$C$18","v":0},{"$f":"D755*Impostos!$C$19","v":0},0,0,null,null,""]
[null,null,null,null,{"$f":"D756*Impostos!$C$15","v":0},{"$f":"D756*Impostos!$C$16","v":0},{"$f":"D756*Impostos!$C$17","v":0},{"$f":"D756*Impostos!$C$18","v":0},{"$f":"D756*Impostos!$C$19","v":0},0,0,null,null,""]
[null,null,null,null,{"$f":"D757*Impostos!$C$15","v":0},{"$f":"D757*Impostos!$C$16","v":0},{"$f":"D757*Impostos!$C$17","v":0},{"$f":"D757*Impostos!$C$18","v":0},{"$f":"D757*Impostos!$C$19","v":0},0,0,null,null,""]
[null,null,null,null,{"$f":"D758*Impostos!$C$15","v":0},{"$f":"D758*Impostos!$C$16","v":0},{"$f":"D758*Impostos!$C$17","v":0},{"$f":"D758*Impostos!$C$18","v":0},{"$f":"D758*Impostos!$C$19","v":0},0,0,null,null,""]
[null,null,null,null,{"$f":"D759*Impostos!$C$15","v":0},{"$f":"D759*Impostos!$C$16","v":0},{"$f":"D759*Impostos!$C$17","v":0},{"$f":"D759*Impostos!$C$18","v":0},{"$f":"D759*Impostos!$C$19","v":0},0,0,null,null,""]
[null,null,null,null,{"$f":"D760*Impostos!$C$15","v":0},{"$f":"D760*Impostos!$C$16","v":0},{"$f":"D760*Impostos!$C$17","v":0},{"$f":"D760*Impostos!$C$18","v":0},{"$f":"D760*Impostos!$C$19","v":0},0,0,null,null,""]
[null,null,null,null,{"$f":"D761*Impostos!$C$15","v":0},{"$f":"D761*Impostos!$C$16","v":0},{"$f":"D761*Impostos!$C$17","v":0},{"$f":"D761*Impostos!$C$18","v":0},{"$f":"D761*Impostos!$C$19","v":0},0,0,null,null,""]
[null,null,null,null,{"$f":"D762*Impostos!$C$15","v":0},{"$f":"D762*Impostos!$C$16","v":0},{"$f":"D762*Impostos!$C$17","v":0},{"$f":"D762*Impostos!$C$18","v":0},{"$f":"D762*Impostos!$C$19","v":0},0,0,null,null,""]
[null,null,null,null,{"$f":"D763*Impostos!$C$15","v":0},{"$f":"D763*Impostos!$C$16","v":0},{"$f":"D763*Impostos!$C$17","v":0},{"$f":"D763*Impostos!$C$18","v":0},{"$f":"D763*Impostos!$C$19","v":0},0,0,null,null,""]
[null,null,null,null,{"$f":"D764*Impostos!$C$15","v":0},{"$f":"D764*Impostos!$C$16","v":0},{"$f":"D764*Impostos!$C$17","v":0},{"$f":"D764*Impostos!$C$18","v":0},{"$f":"D764*Impostos!$C$19","v":0},0,0,null,null,""]
[null,null,null,null,{"$f":"D765*Impostos!$C$15","v":0},{"$f":"D765*Impostos!$C$16","v":0},{"$f":"D765*Impostos!$C$17","v":0},{"$f":"D765*Impostos!$C$18","v":0},{"$f":"D765*Impostos!$C$19","v":0},0,0,null,null,""]
[null,null,null,null,{"$f":"D766*Impostos!$C$15","v":0},{"$f":"D766*Impostos!$C$16","v":0},{"$f":"D766*Impostos!$C$17","v":0},{"$f":"D766*Impostos!$C$18","v":0},{"$f":"D766*Impostos!$C$19","v":0},0,0,null,null,""]
[null,null,null,null,{"$f":"D767*Impostos!$C$15","v":0},{"$f":"D767*Impostos!$C$16","v":0},{"$f":"D767*Impostos!$C$17","v":0},{"$f":"D767*Impostos!$C$18","v":0},{"$f":"D767*Impostos!$C$19","v":0},0,0,null,null,""]
[null,null,null,null,{"$f":"D768*Impostos!$C$15","v":0},{"$f":"D768*Impostos!$C$16","v":0},{"$f":"D768*Impostos!$C$17","v":0},{"$f":"D768*Impostos!$C$18","v":0},{"$f":"D768*Impostos!$C$19","v":0},0,0,null,null,""]
[null,null,null,null,{"$f":"D769*Impostos!$C$15","v":0},{"$f":"D769*Impostos!$C$16","v":0},{"$f":"D769*Impostos!$C$17","v":0},{"$f":"D769*Impostos!$C$18","v":0},{"$f":"D769*Impostos!$C$19","v":0},0,0,null,null,""]
[null,null,null,null,{"$f":"D770*Impostos!$C$15","v":0},{"$f":"D770*Impostos!$C$16","v":0},{"$f":"D770*Impostos!$C$17","v":0},{"$f":"D770*Impostos!$C$18","v":0},{"$f":"D770*Impostos!$C$19","v":0},0,0,null,null,""]
[null,null,null,null,{"$f":"D771*Impostos!$C$15","v":0},{"$f":"D771*Impostos!$C$16","v":0},{"$f":"D771*Impostos!$C$17","v":0},{"$f":"D771*Impostos!$C$18","v":0},{"$f":"D771*Impostos!$C$19","v":0},0,0,null,null,""]
[null,null,null,null,{"$f":"D772*Impostos!$C$15","v":0},{"$f":"D772*Impostos!$C$16","v":0},{"$f":"D772*Impostos!$C$17","v":0},{"$f":"D772*Impostos!$C$18","v":0},{"$f":"D772*Impostos!$C$19","v":0},0,0,null,null,""]
[null,null,null,null,{"$f":"D773*Impostos!$C$15","v":0},{"$f":"D773*Impostos!$C$16","v":0},{"$f":"D773*Impostos!$C$17","v":0},{"$f":"D773*Impostos!$C$18","v":0},{"$f":"D773*Impostos!$C$19","v":0},0,0,null,null,""]
[null,null,null,null,{"$f":"D774*Impostos!$C$15","v":0},{"$f":"D774*Impostos!$C$16","v":0},{"$f":"D774*Impostos!$C$17","v":0},{"$f":"D774*Impostos!$C$18","v":0},{"$f":"D774*Impostos!$C$19","v":0},0,0,null,null,""]
[null,null,null,null,{"$f":"D775*Impostos!$C$15","v":0},{"$f":"D775*Impostos!$C$16","v":0},{"$f":"D775*Impostos!$C$17","v":0},{"$f":"D775*Impostos!$C$18","v":0},{"$f":"D775*Impostos!$C$19","v":0},0,0,null,null,""]
[null,null,null,null,{"$f":"D776*Impostos!$C$15","v":0},{"$f":"D776*Impostos!$C$16","v":0},{"$f":"D776*Impostos!$C$17","v":0},{"$f":"D776*Impostos!$C$18","v":0},{"$f":"D776*Impostos!$C$19","v":0},0,0,null,null,""]
[null,null,null,null,{"$f":"D777*Impostos!$C$15","v":0},{"$f":"D777*Impostos!$C$16","v":0},{"$f":"D777*Impostos!$C$17","v":0},{"$f":"D777*Impostos!$C$18","v":0},{"$f":"D777*Impostos!$C$19","v":0},0,0,null,null,""]
[null,null,null,null,{"$f":"D778*Impostos!$C$15","v":0},{"$f":"D778*Impostos!$C$16","v":0},{"$f":"D778*Impostos!$C$17","v":0},{"$f":"D778*Impostos!$C$18","v":0},{"$f":"D778*Impostos!$C$19","v":0},0,0,null,null,""]
[null,null,null,null,{"$f":"D779*Impostos!$C$15","v":0},{"$f":"D779*Impostos!$C$16","v":0},{"$f":"D779*Impostos!$C$17","v":0},{"$f":"D779*Impostos!$C$18","v":0},{"$f":"D779*Impostos!$C$19","v":0},0,0,null,null,""]
[null,null,null,null,{"$f":"D780*Impostos!$C$15","v":0},{"$f":"D780*Impostos!$C$16","v":0},{"$f":"D780*Impostos!$C$17","v":0},{"$f":"D780*Impostos!$C$18","v":0},{"$f":"D780*Impostos!$C$19","v":0},0,0,null,null,""]
[null,null,null,null,{"$f":"D781*Impostos!$C$15","v":0},{"$f":"D781*Impostos!$C$16","v":0},{"$f":"D781*Impostos!$C$17","v":0},{"$f":"D781*Impostos!$C$18","v":0},{"$f":"D781*Impostos!$C$19","v":0},0,0,null,null,""]
[null,null,null,null,{"$f":"D782*Impostos!$C$15","v":0},{"$f":"D782*Impostos!$C$16","v":0},{"$f":"D782*Impostos!$C$17","v":0},{"$f":"D782*Impostos!$C$18","v":0},{"$f":"D782*Impostos!$C$19","v":0},0,0,null,null,""]
[null,null,null,null,{"$f":"D783*Impostos!$C$15","v":0},{"$f":"D783*Impostos!$C$16","v":0},{"$f":"D783*Impostos!$C$17","v":0},{"$f":"D783*Impostos!$C$18","v":0},{"$f":"D783*Impostos!$C$19","v":0},0,0,null,null,""]
[null,null,null,null,{"$f":"D784*Impostos!$C$15","v":0},{"$f":"D784*Impostos!$C$16","v":0},{"$f":"D784*Impostos!$C$17","v":0},{"$f":"D784*Impostos!$C$18","v":0},{"$f":"D784*Impostos!$C$19","v":0},0,0,null,null,{"$f":"IF(C784=\"\",\"\",MONTH(C784))","v":""}]
[null,null,null,null,{"$f":"D785*Impostos!$C$15","v":0},{"$f":"D785*Impostos!$C$16","v":0},{"$f":"D785*Impostos!$C$17","v":0},{"$f":"D785*Impostos!$C$18","v":0},{"$f":"D785*Impostos!$C$19","v":0},0,0,null,null,""]
[null,null,null,null,{"$f":"D786*Impostos!$C$15","v":0},{"$f":"D786*Impostos!$C$16","v":0},{"$f":"D786*Impostos!$C$17","v":0},{"$f":"D786*Impostos!$C$18","v":0},{"$f":"D786*Impostos!$C$19","v":0},0,0,null,null,""]
[null,null,null,null,{"$f":"D787*Impostos!$C$15","v":0},{"$f":"D787*Impostos!$C$16","v":0},{"$f":"D787*Impostos!$C$17","v":0},{"$f":"D787*Impostos!$C$18","v":0},{"$f":"D787*Impostos!$C$19","v":0},0,0,null,null,""]
[null,null,null,null,{"$f":"D788*Impostos!$C$15","v":0},{"$f":"D788*Impostos!$C$16","v":0},{"$f":"D788*Impostos!$C$17","v":0},{"$f":"D788*Impostos!$C$18","v":0},{"$f":"D788*Impostos!$C$19","v":0},0,0,null,null,""]
[null,null,null,null,{"$f":"D789*Impostos!$C$15","v":0},{"$f":"D789*Impostos!$C$16","v":0},{"$f":"D789*Impostos!$C$17","v":0},{"$f":"D789*Impostos!$C$18","v":0},{"$f":"D789*Impostos!$C$19","v":0},0,0,null,null,""]
[null,null,null,null,{"$f":"D790*Impostos!$C$15","v":0},{"$f":"D790*Impostos!$C$16","v":0},{"$f":"D790*Impostos!$C$17","v":0},{"$f":"D790*Impostos!$C$18","v":0},{"$f":"D790*Impostos!$C$19","v":0},0,0,null,null,""]
[null,null,null,null,{"$f":"D791*Impostos!$C$15","v":0},{"$f":"D791*Impostos!$C$16","v":0},{"$f":"D791*Impostos!$C$17","v":0},{"$f":"D791*Impostos!$C$18","v":0},{"$f":"D791*Impostos!$C$19","v":0},0,0,null,null,""]
[null,null,null,null,{"$f":"D792*Impostos!$C$15","v":0},{"$f":"D792*Impostos!$C$16","v":0},{"$f":"D792*Impostos!$C$17","v":0},{"$f":"D792*Impostos!$C$18","v":0},{"$f":"D792*Impostos!$C$19","v":0},{"$f":"SUM(E792:I792)","v":0},{"$f":"D792-J792","v":0},null,null,""]
[null,null,null,null,{"$f":"D793*Impostos!$C$15","v":0},{"$f":"D793*Impostos!$C$16","v":0},{"$f":"D793*Impostos!$C$17","v":0},{"$f":"D793*Impostos!$C$18","v":0},{"$f":"D793*Impostos!$C$19","v":0},0,0,null,null,""]
[null,null,null,null,{"$f":"D794*Impostos!$C$15","v":0},{"$f":"D794*Impostos!$C$16","v":0},{"$f":"D794*Impostos!$C$17","v":0},{"$f":"D794*Impostos!$C$18","v":0},{"$f":"D794*Impostos!$C$19","v":0},0,0,null,null,""]
[null,null,null,null,{"$f":"D795*Impostos!$C$15","v":0},{"$f":"D795*Impostos!$C$16","v":0},{"$f":"D795*Impostos!$C$17","v":0},{"$f":"D795*Impostos!$C$18","v":0},{"$f":"D795*Impostos!$C$19","v":0},0,0,null,null,""]
[null,null,null,null,{"$f":"D796*Impostos!$C$15","v":0},{"$f":"D796*Impostos!$C$16","v":0},{"$f":"D796*Impostos!$C$17","v":0},{"$f":"D796*Impostos!$C$18","v":0},{"$f":"D796*Impostos!$C$19","v":0},0,0,null,null,""]
[null,null,null,null,{"$f":"D797*Impostos!$C$15","v":0},{"$f":"D797*Impostos!$C$16","v":0},{"$f":"D797*Impostos!$C$17","v":0},{"$f":"D797*Impostos!$C$18","v":0},{"$f":"D797*Impostos!$C$19","v":0},0,0,null,null,""]
[null,null,null,null,{"$f":"D798*Impostos!$C$15","v":0},{"$f":"D798*Impostos!$C$16","v":0},{"$f":"D798*Impostos!$C$17","v":0},{"$f":"D798*Impostos!$C$18","v":0},{"$f":"D798*Impostos!$C$19","v":0},0,0,null,null,""]
[null,null,null,null,{"$f":"D799*Impostos!$C$15","v":0},{"$f":"D799*Impostos!$C$16","v":0},{"$f":"D799*Impostos!$C$17","v":0},{"$f":"D799*Impostos!$C$18","v":0},{"$f":"D799*Impostos!$C$19","v":0},0,0,null,null,""]
[null,null,null,null,{"$f":"D800*Impostos!$C$15","v":0},{"$f":"D800*Impostos!$C$16","v":0},{"$f":"D800*Impostos!$C$17","v":0},{"$f":"D800*Impostos!$C$18","v":0},{"$f":"D800*Impostos!$C$19","v":0},0,0,null,null,""]
[null,null,null,null,{"$f":"D801*Impostos!$C$15","v":0},{"$f":"D801*Impostos!$C$16","v":0},{"$f":"D801*Impostos!$C$17","v":0},{"$f":"D801*Impostos!$C$18","v":0},{"$f":"D801*Impostos!$C$19","v":0},0,0,null,null,""]
[null,null,null,null,{"$f":"D802*Impostos!$C$15","v":0},{"$f":"D802*Impostos!$C$16","v":0},{"$f":"D802*Impostos!$C$17","v":0},{"$f":"D802*Impostos!$C$18","v":0},{"$f":"D802*Impostos!$C$19","v":0},0,0,null,null,""]
[null,null,null,null,{"$f":"D803*Impostos!$C$15","v":0},{"$f":"D803*Impostos!$C$16","v":0},{"$f":"D803*Impostos!$C$17","v":0},{"$f":"D803*Impostos!$C$18","v":0},{"$f":"D803*Impostos!$C$19","v":0},0,0,null,null,""]
[null,null,null,null,{"$f":"D804*Impostos!$C$15","v":0},{"$f":"D804*Impostos!$C$16","v":0},{"$f":"D804*Impostos!$C$17","v":0},{"$f":"D804*Impostos!$C$18","v":0},{"$f":"D804*Impostos!$C$19","v":0},0,0,null,null,""]
[null,null,null,null,{"$f":"D805*Impostos!$C$15","v":0},{"$f":"D805*Impostos!$C$16","v":0},{"$f":"D805*Impostos!$C$17","v":0},{"$f":"D805*Impostos!$C$18","v":0},{"$f":"D805*Impostos!$C$19","v":0},0,0,null,null,""]
[null,null,null,null,{"$f":"D806*Impostos!$C$15","v":0},{"$f":"D806*Impostos!$C$16","v":0},{"$f":"D806*Impostos!$C$17","v":0},{"$f":"D806*Impostos!$C$18","v":0},{"$f":"D806*Impostos!$C$19","v":0},0,0,null,null,""]
[null,null,null,null,{"$f":"D807*Impostos!$C$15","v":0},{"$f":"D807*Impostos!$C$16","v":0},{"$f":"D807*Impostos!$C$17","v":0},{"$f":"D807*Impostos!$C$18","v":0},{"$f":"D807*Impostos!$C$19","v":0},0,0,null,null,""]
[null,null,null,null,{"$f":"D808*Impostos!$C$15","v":0},{"$f":"D808*Impostos!$C$16","v":0},{"$f":"D808*Impostos!$C$17","v":0},{"$f":"D808*Impostos!$C$18","v":0},{"$f":"D808*Impostos!$C$19","v":0},0,0,null,null,""]
[null,null,null,null,{"$f":"D809*Impostos!$C$15","v":0},{"$f":"D809*Impostos!$C$16","v":0},{"$f":"D809*Impostos!$C$17","v":0},{"$f":"D809*Impostos!$C$18","v":0},{"$f":"D809*Impostos!$C$19","v":0},0,0,null,null,""]
[null,null,null,null,{"$f":"D810*Impostos!$C$15","v":0},{"$f":"D810*Impostos!$C$16","v":0},{"$f":"D810*Impostos!$C$17","v":0},{"$f":"D810*Impostos!$C$18","v":0},{"$f":"D810*Impostos!$C$19","v":0},0,0,null,null,""]
[null,null,null,null,{"$f":"D811*Impostos!$C$15","v":0},{"$f":"D811*Impostos!$C$16","v":0},{"$f":"D811*Impostos!$C$17","v":0},{"$f":"D811*Impostos!$C$18","v":0},{"$f":"D811*Impostos!$C$19","v":0},0,0,null,null,""]
[null,null,null,null,{"$f":"D812*Impostos!$C$15","v":0},{"$f":"D812*Impostos!$C$16","v":0},{"$f":"D812*Impostos!$C$17","v":0},{"$f":"D812*Impostos!$C$18","v":0},{"$f":"D812*Impostos!$C$19","v":0},0,0,null,null,""]
[null,null,null,null,{"$f":"D813*Impostos!$C$15","v":0},{"$f":"D813*Impostos!$C$16","v":0},{"$f":"D813*Impostos!$C$17","v":0},{"$f":"D813*Impostos!$C$18","v":0},{"$f":"D813*Impostos!$C$19","v":0},0,0,null,null,""]
[null,null,null,null,{"$f":"D814*Impostos!$C$15","v":0},{"$f":"D814*Impostos!$C$16","v":0},{"$f":"D814*Impostos!$C$17","v":0},{"$f":"D814*Impostos!$C$18","v":0},{"$f":"D814*Impostos!$C$19","v":0},0,0,null,null,""]
[null,null,null,null,{"$f":"D815*Impostos!$C$15","v":0},{"$f":"D815*Impostos!$C$16","v":0},{"$f":"D815*Impostos!$C$17","v":0},{"$f":"D815*Impostos!$C$18","v":0},{"$f":"D815*Impostos!$C$19","v":0},0,0,null,null,""]
[null,null,null,null,{"$f":"D816*Impostos!$C$15","v":0},{"$f":"D816*Impostos!$C$16","v":0},{"$f":"D816*Impostos!$C$17","v":0},{"$f":"D816*Impostos!$C$18","v":0},{"$f":"D816*Impostos!$C$19","v":0},0,0,null,null,""]
[null,null,null,null,{"$f":"D817*Impostos!$C$15","v":0},{"$f":"D817*Impostos!$C$16","v":0},{"$f":"D817*Impostos!$C$17","v":0},{"$f":"D817*Impostos!$C$18","v":0},{"$f":"D817*Impostos!$C$19","v":0},0,0,null,null,""]
[null,null,null,null,{"$f":"D818*Impostos!$C$15","v":0},{"$f":"D818*Impostos!$C$16","v":0},{"$f":"D818*Impostos!$C$17","v":0},{"$f":"D818*Impostos!$C$18","v":0},{"$f":"D818*Impostos!$C$19","v":0},0,0,null,null,""]
[null,null,null,null,{"$f":"D819*Impostos!$C$15","v":0},{"$f":"D819*Impostos!$C$16","v":0},{"$f":"D819*Impostos!$C$17","v":0},{"$f":"D819*Impostos!$C$18","v":0},{"$f":"D819*Impostos!$C$19","v":0},0,0,null,null,""]
[null,null,null,null,{"$f":"D820*Impostos!$C$15","v":0},{"$f":"D820*Impostos!$C$16","v":0},{"$f":"D820*Impostos!$C$17","v":0},{"$f":"D820*Impostos!$C$18","v":0},{"$f":"D820*Impostos!$C$19","v":0},0,0,null,null,""]
[null,null,null,null,{"$f":"D821*Impostos!$C$15","v":0},{"$f":"D821*Impostos!$C$16","v":0},{"$f":"D821*Impostos!$C$17","v":0},{"$f":"D821*Impostos!$C$18","v":0},{"$f":"D821*Impostos!$C$19","v":0},0,0,null,null,""]
[null,null,null,null,{"$f":"D822*Impostos!$C$15","v":0},{"$f":"D822*Impostos!$C$16","v":0},{"$f":"D822*Impostos!$C$17","v":0},{"$f":"D822*Impostos!$C$18","v":0},{"$f":"D822*Impostos!$C$19","v":0},0,0,null,null,""]
[null,null,null,null,{"$f":"D823*Impostos!$C$15","v":0},{"$f":"D823*Impostos!$C$16","v":0},{"$f":"D823*Impostos!$C$17","v":0},{"$f":"D823*Impostos!$C$18","v":0},{"$f":"D823*Impostos!$C$19","v":0},0,0,null,null,""]
[null,null,null,null,{"$f":"D824*Impostos!$C$15","v":0},{"$f":"D824*Impostos!$C$16","v":0},{"$f":"D824*Impostos!$C$17","v":0},{"$f":"D824*Impostos!$C$18","v":0},{"$f":"D824*Impostos!$C$19","v":0},0,0,null,null,""]
[null,null,null,null,{"$f":"D825*Impostos!$C$15","v":0},{"$f":"D825*Impostos!$C$16","v":0},{"$f":"D825*Impostos!$C$17","v":0},{"$f":"D825*Impostos!$C$18","v":0},{"$f":"D825*Impostos!$C$19","v":0},0,0,null,null,""]
[null,null,null,null,{"$f":"D826*Impostos!$C$15","v":0},{"$f":"D826*Impostos!$C$16","v":0},{"$f":"D826*Impostos!$C$17","v":0},{"$f":"D826*Impostos!$C$18","v":0},{"$f":"D826*Impostos!$C$19","v":0},0,0,null,null,""]
[null,null,null,null,{"$f":"D827*Impostos!$C$15","v":0},{"$f":"D827*Impostos!$C$16","v":0},{"$f":"D827*Impostos!$C$17","v":0},{"$f":"D827*Impostos!$C$18","v":0},{"$f":"D827*Impostos!$C$19","v":0},0,0,null,null,""]
[null,null,null,null,{"$f":"D828*Impostos!$C$15","v":0},{"$f":"D828*Impostos!$C$16","v":0},{"$f":"D828*Impostos!$C$17","v":0},{"$f":"D828*Impostos!$C$18","v":0},{"$f":"D828*Impostos!$C$19","v":0},0,0,null,null,""]
[null,null,null,null,{"$f":"D829*Impostos!$C$15","v":0},{"$f":"D829*Impostos!$C$16","v":0},{"$f":"D829*Impostos!$C$17","v":0},{"$f":"D829*Impostos!$C$18","v":0},{"$f":"D829*Impostos!$C$19","v":0},0,0,null,null,""]
[null,null,null,null,{"$f":"D830*Impostos!$C$15","v":0},{"$f":"D830*Impostos!$C$16","v":0},{"$f":"D830*Impostos!$C$17","v":0},{"$f":"D830*Impostos!$C$18","v":0},{"$f":"D830*Impostos!$C$19","v":0},0,0,null,null,""]
[null,null,null,null,{"$f":"D831*Impostos!$C$15","v":0},{"$f":"D831*Impostos!$C$16","v":0},{"$f":"D831*Impostos!$C$17","v":0},{"$f":"D831*Impostos!$C$18","v":0},{"$f":"D831*Impostos!$C$19","v":0},0,0,null,null,""]
[null,null,null,null,{"$f":"D832*Impostos!$C$15","v":0},{"$f":"D832*Impostos!$C$16","v":0},{"$f":"D832*Impostos!$C$17","v":0},{"$f":"D832*Impostos!$C$18","v":0},{"$f":"D832*Impostos!$C$19","v":0},0,0,null,null,""]
[null,null,null,null,{"$f":"D833*Impostos!$C$15","v":0},{"$f":"D833*Impostos!$C$16","v":0},{"$f":"D833*Impostos!$C$17","v":0},{"$f":"D833*Impostos!$C$18","v":0},{"$f":"D833*Impostos!$C$19","v":0},0,0,null,null,""]
[null,null,null,null,{"$f":"D834*Impostos!$C$15","v":0},{"$f":"D834*Impostos!$C$16","v":0},{"$f":"D834*Impostos!$C$17","v":0},{"$f":"D834*Impostos!$C$18","v":0},{"$f":"D834*Impostos!$C$19","v":0},0,0,null,null,""]
[null,null,null,null,{"$f":"D835*Impostos!$C$15","v":0},{"$f":"D835*Impostos!$C$16","v":0},{"$f":"D835*Impostos!$C$17","v":0},{"$f":"D835*Impostos!$C$18","v":0},{"$f":"D835*Impostos!$C$19","v":0},0,0,null,null,""]
[null,null,null,null,{"$f":"D836*Impostos!$C$15","v":0},{"$f":"D836*Impostos!$C$16","v":0},{"$f":"D836*Impostos!$C$17","v":0},{"$f":"D836*Impostos!$C$18","v":0},{"$f":"D836*Impostos!$C$19","v":0},0,0,null,null,""]
[null,null,null,null,{"$f":"D837*Impostos!$C$15","v":0},{"$f":"D837*Impostos!$C$16","v":0},{"$f":"D837*Impostos!$C$17","v":0},{"$f":"D837*Impostos!$C$18","v":0},{"$f":"D837*Impostos!$C$19","v":0},0,0,null,null,""]
[null,null,null,null,{"$f":"D838*Impostos!$C$15","v":0},{"$f":"D838*Impostos!$C$16","v":0},{"$f":"D838*Impostos!$C$17","v":0},{"$f":"D838*Impostos!$C$18","v":0},{"$f":"D838*Impostos!$C$19","v":0},0,0,null,null,""]
[null,null,null,null,{"$f":"D839*Impostos!$C$15","v":0},{"$f":"D839*Impostos!$C$16","v":0},{"$f":"D839*Impostos!$C$17","v":0},{"$f":"D839*Impostos!$C$18","v":0},{"$f":"D839*Impostos!$C$19","v":0},0,0,null,null,""]
[null,null,null,null,{"$f":"D840*Impostos!$C$15","v":0},{"$f":"D840*Impostos!$C$16","v":0},{"$f":"D840*Impostos!$C$17","v":0},{"$f":"D840*Impostos!$C$18","v":0},{"$f":"D840*Impostos!$C$19","v":0},0,0,null,null,""]
[null,null,null,null,{"$f":"D841*Impostos!$C$15","v":0},{"$f":"D841*Impostos!$C$16","v":0},{"$f":"D841*Impostos!$C$17","v":0},{"$f":"D841*Impostos!$C$18","v":0},{"$f":"D841*Impostos!$C$19","v":0},0,0,null,null,""]
[null,null,null,null,{"$f":"D842*Impostos!$C$15","v":0},{"$f":"D842*Impostos!$C$16","v":0},{"$f":"D842*Impostos!$C$17","v":0},{"$f":"D842*Impostos!$C$18","v":0},{"$f":"D842*Impostos!$C$19","v":0},0,0,null,null,""]
[null,null,null,null,{"$f":"D843*Impostos!$C$15","v":0},{"$f":"D843*Impostos!$C$16","v":0},{"$f":"D843*Impostos!$C$17","v":0},{"$f":"D843*Impostos!$C$18","v":0},{"$f":"D843*Impostos!$C$19","v":0},0,0,null,null,""]
[null,null,null,null,{"$f":"D844*Impostos!$C$15","v":0},{"$f":"D844*Impostos!$C$16","v":0},{"$f":"D844*Impostos!$C$17","v":0},{"$f":"D844*Impostos!$C$18","v":0},{"$f":"D844*Impostos!$C$19","v":0},0,0,null,null,""]
[null,null,null,null,{"$f":"D845*Impostos!$C$15","v":0},{"$f":"D845*Impostos!$C$16","v":0},{"$f":"D845*Impostos!$C$17","v":0},{"$f":"D845*Impostos!$C$18","v":0},{"$f":"D845*Impostos!$C$19","v":0},0,0,null,null,""]
[null,null,null,null,{"$f":"D846*Impostos!$C$15","v":0},{"$f":"D846*Impostos!$C$16","v":0},{"$f":"D846*Impostos!$C$17","v":0},{"$f":"D846*Impostos!$C$18","v":0},{"$f":"D846*Impostos!$C$19","v":0},0,0,null,null,""]
[null,null,null,null,{"$f":"D847*Impostos!$C$15","v":0},{"$f":"D847*Impostos!$C$16","v":0},{"$f":"D847*Impostos!$C$17","v":0},{"$f":"D847*Impostos!$C$18","v":0},{"$f":"D847*Impostos!$C$19","v":0},0,0,null,null,""]
[null,null,null,null,{"$f":"D848*Impostos!$C$15","v":0},{"$f":"D848*Impostos!$C$16","v":0},{"$f":"D848*Impostos!$C$17","v":0},{"$f":"D848*Impostos!$C$18","v":0},{"$f":"D848*Impostos!$C$19","v":0},0,0,null,null,{"$f":"IF(C848=\"\",\"\",MONTH(C848))","v":""}]
[null,null,null,null,{"$f":"D849*Impostos!$C$15","v":0},{"$f":"D849*Impostos!$C$16","v":0},{"$f":"D849*Impostos!$C$17","v":0},{"$f":"D849*Impostos!$C$18","v":0},{"$f":"D849*Impostos!$C$19","v":0},0,0,null,null,""]
[null,null,null,null,{"$f":"D850*Impostos!$C$15","v":0},{"$f":"D850*Impostos!$C$16","v":0},{"$f":"D850*Impostos!$C$17","v":0},{"$f":"D850*Impostos!$C$18","v":0},{"$f":"D850*Impostos!$C$19","v":0},0,0,null,null,""]
[null,null,null,null,{"$f":"D851*Impostos!$C$15","v":0},{"$f":"D851*Impostos!$C$16","v":0},{"$f":"D851*Impostos!$C$17","v":0},{"$f":"D851*Impostos!$C$18","v":0},{"$f":"D851*Impostos!$C$19","v":0},0,0,null,null,""]
[null,null,null,null,{"$f":"D852*Impostos!$C$15","v":0},{"$f":"D852*Impostos!$C$16","v":0},{"$f":"D852*Impostos!$C$17","v":0},{"$f":"D852*Impostos!$C$18","v":0},{"$f":"D852*Impostos!$C$19","v":0},0,0,null,null,""]
[null,null,null,null,{"$f":"D853*Impostos!$C$15","v":0},{"$f":"D853*Impostos!$C$16","v":0},{"$f":"D853*Impostos!$C$17","v":0},{"$f":"D853*Impostos!$C$18","v":0},{"$f":"D853*Impostos!$C$19","v":0},0,0,null,null,""]
[null,null,null,null,{"$f":"D854*Impostos!$C$15","v":0},{"$f":"D854*Impostos!$C$16","v":0},{"$f":"D854*Impostos!$C$17","v":0},{"$f":"D854*Impostos!$C$18","v":0},{"$f":"D854*Impostos!$C$19","v":0},0,0,null,null,""]
[null,null,null,null,{"$f":"D855*Impostos!$C$15","v":0},{"$f":"D855*Impostos!$C$16","v":0},{"$f":"D855*Impostos!$C$17","v":0},{"$f":"D855*Impostos!$C$18","v":0},{"$f":"D855*Impostos!$C$19","v":0},0,0,null,null,""]
[null,null,null,null,{"$f":"D856*Impostos!$C$15","v":0},{"$f":"D856*Impostos!$C$16","v":0},{"$f":"D856*Impostos!$C$17","v":0},{"$f":"D856*Impostos!$C$18","v":0},{"$f":"D856*Impostos!$C$19","v":0},{"$f":"SUM(E856:I856)","v":0},{"$f":"D856-J856","v":0},null,null,""]
[null,null,null,null,{"$f":"D857*Impostos!$C$15","v":0},{"$f":"D857*Impostos!$C$16","v":0},{"$f":"D857*Impostos!$C$17","v":0},{"$f":"D857*Impostos!$C$18","v":0},{"$f":"D857*Impostos!$C$19","v":0},0,0,null,null,""]
[null,null,null,null,{"$f":"D858*Impostos!$C$15","v":0},{"$f":"D858*Impostos!$C$16","v":0},{"$f":"D858*Impostos!$C$17","v":0},{"$f":"D858*Impostos!$C$18","v":0},{"$f":"D858*Impostos!$C$19","v":0},0,0,null,null,""]
[null,null,null,null,{"$f":"D859*Impostos!$C$15","v":0},{"$f":"D859*Impostos!$C$16","v":0},{"$f":"D859*Impostos!$C$17","v":0},{"$f":"D859*Impostos!$C$18","v":0},{"$f":"D859*Impostos!$C$19","v":0},0,0,null,null,""]
[null,null,null,null,{"$f":"D860*Impostos!$C$15","v":0},{"$f":"D860*Impostos!$C$16","v":0},{"$f":"D860*Impostos!$C$17","v":0},{"$f":"D860*Impostos!$C$18","v":0},{"$f":"D860*Impostos!$C$19","v":0},0,0,null,null,""]
[null,null,null,null,{"$f":"D861*Impostos!$C$15","v":0},{"$f":"D861*Impostos!$C$16","v":0},{"$f":"D861*Impostos!$C$17","v":0},{"$f":"D861*Impostos!$C$18","v":0},{"$f":"D861*Impostos!$C$19","v":0},0,0,null,null,""]
[null,null,null,null,{"$f":"D862*Impostos!$C$15","v":0},{"$f":"D862*Impostos!$C$16","v":0},{"$f":"D862*Impostos!$C$17","v":0},{"$f":"D862*Impostos!$C$18","v":0},{"$f":"D862*Impostos!$C$19","v":0},0,0,null,null,""]
[null,null,null,null,{"$f":"D863*Impostos!$C$15","v":0},{"$f":"D863*Impostos!$C$16","v":0},{"$f":"D863*Impostos!$C$17","v":0},{"$f":"D863*Impostos!$C$18","v":0},{"$f":"D863*Impostos!$C$19","v":0},0,0,null,null,""]
[null,null,null,null,{"$f":"D864*Impostos!$C$15","v":0},{"$f":"D864*Impostos!$C$16","v":0},{"$f":"D864*Impostos!$C$17","v":0},{"$f":"D864*Impostos!$C$18","v":0},{"$f":"D864*Impostos!$C$19","v":0},0,0,null,null,""]
[null,null,null,null,{"$f":"D865*Impostos!$C$15","v":0},{"$f":"D865*Impostos!$C$16","v":0},{"$f":"D865*Impostos!$C$17","v":0},{"$f":"D865*Impostos!$C$18","v":0},{"$f":"D865*Impostos!$C$19","v":0},0,0,null,null,""]
[null,null,null,null,{"$f":"D866*Impostos!$C$15","v":0},{"$f":"D866*Impostos!$C$16","v":0},{"$f":"D866*Impostos!$C$17","v":0},{"$f":"D866*Impostos!$C$18","v":0},{"$f":"D866*Impostos!$C$19","v":0},0,0,null,null,""]
[null,null,null,null,{"$f":"D867*Impostos!$C$15","v":0},{"$f":"D867*Impostos!$C$16","v":0},{"$f":"D867*Impostos!$C$17","v":0},{"$f":"D867*Impostos!$C$18","v":0},{"$f":"D867*Impostos!$C$19","v":0},0,0,null,null,""]
[null,null,null,null,{"$f":"D868*Impostos!$C$15","v":0},{"$f":"D868*Impostos!$C$16","v":0},{"$f":"D868*Impostos!$C$17","v":0},{"$f":"D868*Impostos!$C$18","v":0},{"$f":"D868*Impostos!$C$19","v":0},0,0,null,null,""]
[null,null,null,null,{"$f":"D869*Impostos!$C$15","v":0},{"$f":"D869*Impostos!$C$16","v":0},{"$f":"D869*Impostos!$C$17","v":0},{"$f":"D869*Impostos!$C$18","v":0},{"$f":"D869*Impostos!$C$19","v":0},0,0,null,null,""]
[null,null,null,null,{"$f":"D870*Impostos!$C$15","v":0},{"$f":"D870*Impostos!$C$16","v":0},{"$f":"D870*Impostos!$C$17","v":0},{"$f":"D870*Impostos!$C$18","v":0},{"$f":"D870*Impostos!$C$19","v":0},0,0,null,null,""]
[null,null,null,null,{"$f":"D871*Impostos!$C$15","v":0},{"$f":"D871*Impostos!$C$16","v":0},{"$f":"D871*Impostos!$C$17","v":0},{"$f":"D871*Impostos!$C$18","v":0},{"$f":"D871*Impostos!$C$19","v":0},0,0,null,null,""]
[null,null,null,null,{"$f":"D872*Impostos!$C$15","v":0},{"$f":"D872*Impostos!$C$16","v":0},{"$f":"D872*Impostos!$C$17","v":0},{"$f":"D872*Impostos!$C$18","v":0},{"$f":"D872*Impostos!$C$19","v":0},0,0,null,null,""]
[null,null,null,null,{"$f":"D873*Impostos!$C$15","v":0},{"$f":"D873*Impostos!$C$16","v":0},{"$f":"D873*Impostos!$C$17","v":0},{"$f":"D873*Impostos!$C$18","v":0},{"$f":"D873*Impostos!$C$19","v":0},0,0,null,null,""]
[null,null,null,null,{"$f":"D874*Impostos!$C$15","v":0},{"$f":"D874*Impostos!$C$16","v":0},{"$f":"D874*Impostos!$C$17","v":0},{"$f":"D874*Impostos!$C$18","v":0},{"$f":"D874*Impostos!$C$19","v":0},0,0,null,null,""]
[null,null,null,null,{"$f":"D875*Impostos!$C$15","v":0},{"$f":"D875*Impostos!$C$16","v":0},{"$f":"D875*Impostos!$C$17","v":0},{"$f":"D875*Impostos!$C$18","v":0},{"$f":"D875*Impostos!$C$19","v":0},0,0,null,null,""]
[null,null,null,null,{"$f":"D876*Impostos!$C$15","v":0},{"$f":"D876*Impostos!$C$16","v":0},{"$f":"D876*Impostos!$C$17","v":0},{"$f":"D876*Impostos!$C$18","v":0},{"$f":"D876*Impostos!$C$19","v":0},0,0,null,null,""]
[null,null,null,null,{"$f":"D877*Impostos!$C$15","v":0},{"$f":"D877*Impostos!$C$16","v":0},{"$f":"D877*Impostos!$C$17","v":0},{"$f":"D877*Impostos!$C$18","v":0},{"$f":"D877*Impostos!$C$19","v":0},0,0,null,null,""]
[null,null,null,null,{"$f":"D878*Impostos!$C$15","v":0},{"$f":"D878*Impostos!$C$16","v":0},{"$f":"D878*Impostos!$C$17","v":0},{"$f":"D878*Impostos!$C$18","v":0},{"$f":"D878*Impostos!$C$19","v":0},0,0,null,null,""]
[null,null,null,null,{"$f":"D879*Impostos!$C$15","v":0},{"$f":"D879*Impostos!$C$16","v":0},{"$f":"D879*Impostos!$C$17","v":0},{"$f":"D879*Impostos!$C$18","v":0},{"$f":"D879*Impostos!$C$19","v":0},0,0,null,null,""]
[null,null,null,null,{"$f":"D880*Impostos!$C$15","v":0},{"$f":"D880*Impostos!$C$16","v":0},{"$f":"D880*Impostos!$C$17","v":0},{"$f":"D880*Impostos!$C$18","v":0},{"$f":"D880*Impostos!$C$19","v":0},0,0,null,null,""]
[null,null,null,null,{"$f":"D881*Impostos!$C$15","v":0},{"$f":"D881*Impostos!$C$16","v":0},{"$f":"D881*Impostos!$C$17","v":0},{"$f":"D881*Impostos!$C$18","v":0},{"$f":"D881*Impostos!$C$19","v":0},0,0,null,null,""]
[null,null,null,null,{"$f":"D882*Impostos!$C$15","v":0},{"$f":"D882*Impostos!$C$16","v":0},{"$f":"D882*Impostos!$C$17","v":0},{"$f":"D882*Impostos!$C$18","v":0},{"$f":"D882*Impostos!$C$19","v":0},0,0,null,null,""]
[null,null,null,null,{"$f":"D883*Impostos!$C$15","v":0},{"$f":"D883*Impostos!$C$16","v":0},{"$f":"D883*Impostos!$C$17","v":0},{"$f":"D883*Impostos!$C$18","v":0},{"$f":"D883*Impostos!$C$19","v":0},0,0,null,null,""]
[null,null,null,null,{"$f":"D884*Impostos!$C$15","v":0},{"$f":"D884*Impostos!$C$16","v":0},{"$f":"D884*Impostos!$C$17","v":0},{"$f":"D884*Impostos!$C$18","v":0},{"$f":"D884*Impostos!$C$19","v":0},0,0,null,null,""]
[null,null,null,null,{"$f":"D885*Impostos!$C$15","v":0},{"$f":"D885*Impostos!$C$16","v":0},{"$f":"D885*Impostos!$C$17","v":0},{"$f":"D885*Impostos!$C$18","v":0},{"$f":"D885*Impostos!$C$19","v":0},0,0,null,null,""]
[null,null,null,null,{"$f":"D886*Impostos!$C$15","v":0},{"$f":"D886*Impostos!$C$16","v":0},{"$f":"D886*Impostos!$C$17","v":0},{"$f":"D886*Impostos!$C$18","v":0},{"$f":"D886*Impostos!$C$19","v":0},0,0,null,null,""]
[null,null,null,null,{"$f":"D887*Impostos!$C$15","v":0},{"$f":"D887*Impostos!$C$16","v":0},{"$f":"D887*Impostos!$C$17","v":0},{"$f":"D887*Impostos!$C$18","v":0},{"$f":"D887*Impostos!$C$19","v":0},0,0,null,null,""]
[null,null,null,null,{"$f":"D888*Impostos!$C$15","v":0},{"$f":"D888*Impostos!$C$16","v":0},{"$f":"D888*Impostos!$C$17","v":0},{"$f":"D888*Impostos!$C$18","v":0},{"$f":"D888*Impostos!$C$19","v":0},0,0,null,null,""]
[null,null,null,null,{"$f":"D889*Impostos!$C$15","v":0},{"$f":"D889*Impostos!$C$16","v":0},{"$f":"D889*Impostos!$C$17","v":0},{"$f":"D889*Impostos!$C$18","v":0},{"$f":"D889*Impostos!$C$19","v":0},0,0,null,null,""]
[null,null,null,null,{"$f":"D890*Impostos!$C$15","v":0},{"$f":"D890*Impostos!$C$16","v":0},{"$f":"D890*Impostos!$C$17","v":0},{"$f":"D890*Impostos!$C$18","v":0},{"$f":"D890*Impostos!$C$19","v":0},0,0,null,null,""]
[null,null,null,null,{"$f":"D891*Impostos!$C$15","v":0},{"$f":"D891*Impostos!$C$16","v":0},{"$f":"D891*Impostos!$C$17","v":0},{"$f":"D891*Impostos!$C$18","v":0},{"$f":"D891*Impostos!$C$19","v":0},0,0,null,null,""]
[null,null,null,null,{"$f":"D892*Impostos!$C$15","v":0},{"$f":"D892*Impostos!$C$16","v":0},{"$f":"D892*Impostos!$C$17","v":0},{"$f":"D892*Impostos!$C$18","v":0},{"$f":"D892*Impostos!$C$19","v":0},0,0,null,null,""]
[null,null,null,null,{"$f":"D893*Impostos!$C$15","v":0},{"$f":"D893*Impostos!$C$16","v":0},{"$f":"D893*Impostos!$C$17","v":0},{"$f":"D893*Impostos!$C$18","v":0},{"$f":"D893*Impostos!$C$19","v":0},0,0,null,null,""]
[null,null,null,null,{"$f":"D894*Impostos!$C$15","v":0},{"$f":"D894*Impostos!$C$16","v":0},{"$f":"D894*Impostos!$C$17","v":0},{"$f":"D894*Impostos!$C$18","v":0},{"$f":"D894*Impostos!$C$19","v":0},0,0,null,null,""]
[null,null,null,null,{"$f":"D895*Impostos!$C$15","v":0},{"$f":"D895*Impostos!$C$16","v":0},{"$f":"D895*Impostos!$C$17","v":0},{"$f":"D895*Impostos!$C$18","v":0},{"$f":"D895*Impostos!$C$19","v":0},0,0,null,null,""]
[null,null,null,null,{"$f":"D896*Impostos!$C$15","v":0},{"$f":"D896*Impostos!$C$16","v":0},{"$f":"D896*Impostos!$C$17","v":0},{"$f":"D896*Impostos!$C$18","v":0},{"$f":"D896*Impostos!$C$19","v":0},0,0,null,null,""]
[null,null,null,null,{"$f":"D897*Impostos!$C$15","v":0},{"$f":"D897*Impostos!$C$16","v":0},{"$f":"D897*Impostos!$C$17","v":0},{"$f":"D897*Impostos!$C$18","v":0},{"$f":"D897*Impostos!$C$19","v":0},0,0,null,null,""]
[null,null,null,null,{"$f":"D898*Impostos!$C$15","v":0},{"$f":"D898*Impostos!$C$16","v":0},{"$f":"D898*Impostos!$C$17","v":0},{"$f":"D898*Impostos!$C$18","v":0},{"$f":"D898*Impostos!$C$19","v":0},0,0,null,null,""]
[null,null,null,null,{"$f":"D899*Impostos!$C$15","v":0},{"$f":"D899*Impostos!$C$16","v":0},{"$f":"D899*Impostos!$C$17","v":0},{"$f":"D899*Impostos!$C$18","v":0},{"$f":"D899*Impostos!$C$19","v":0},0,0,null,null,""]
[null,null,null,null,{"$f":"D900*Impostos!$C$15","v":0},{"$f":"D900*Impostos!$C$16","v":0},{"$f":"D900*Impostos!$C$17","v":0},{"$f":"D900*Impostos!$C$18","v":0},{"$f":"D900*Impostos!$C$19","v":0},0,0,null,null,""]
[null,null,null,null,{"$f":"D901*Impostos!$C$15","v":0},{"$f":"D901*Impostos!$C$16","v":0},{"$f":"D901*Impostos!$C$17","v":0},{"$f":"D901*Impostos!$C$18","v":0},{"$f":"D901*Impostos!$C$19","v":0},0,0,null,null,""]
[null,null,null,null,{"$f":"D902*Impostos!$C$15","v":0},{"$f":"D902*Impostos!$C$16","v":0},{"$f":"D902*Impostos!$C$17","v":0},{"$f":"D902*Impostos!$C$18","v":0},{"$f":"D902*Impostos!$C$19","v":0},0,0,null,null,""]
[null,null,null,null,{"$f":"D903*Impostos!$C$15","v":0},{"$f":"D903*Impostos!$C$16","v":0},{"$f":"D903*Impostos!$C$17","v":0},{"$f":"D903*Impostos!$C$18","v":0},{"$f":"D903*Impostos!$C$19","v":0},0,0,null,null,""]
[null,null,null,null,{"$f":"D904*Impostos!$C$15","v":0},{"$f":"D904*Impostos!$C$16","v":0},{"$f":"D904*Impostos!$C$17","v":0},{"$f":"D904*Impostos!$C$18","v":0},{"$f":"D904*Impostos!$C$19","v":0},0,0,null,null,""]
[null,null,null,null,{"$f":"D905*Impostos!$C$15","v":0},{"$f":"D905*Impostos!$C$16","v":0},{"$f":"D905*Impostos!$C$17","v":0},{"$f":"D905*Impostos!$C$18","v":0},{"$f":"D905*Impostos!$C$19","v":0},0,0,null,null,""]
[null,null,null,null,{"$f":"D906*Impostos!$C$15","v":0},{"$f":"D906*Impostos!$C$16","v":0},{"$f":"D906*Impostos!$C$17","v":0},{"$f":"D906*Impostos!$C$18","v":0},{"$f":"D906*Impostos!$C$19","v":0},0,0,null,null,""]
[null,null,null,null,{"$f":"D907*Impostos!$C$15","v":0},{"$f":"D907*Impostos!$C$16","v":0},{"$f":"D907*Impostos!$C$17","v":0},{"$f":"D907*Impostos!$C$18","v":0},{"$f":"D907*Impostos!$C$19","v":0},0,0,null,null,""]
[null,null,null,null,{"$f":"D908*Impostos!$C$15","v":0},{"$f":"D908*Impostos!$C$16","v":0},{"$f":"D908*Impostos!$C$17","v":0},{"$f":"D908*Impostos!$C$18","v":0},{"$f":"D908*Impostos!$C$19","v":0},0,0,null,null,""]
[null,null,null,null,{"$f":"D909*Impostos!$C$15","v":0},{"$f":"D909*Impostos!$C$16","v":0},{"$f":"D909*Impostos!$C$17","v":0},{"$f":"D909*Impostos!$C$18","v":0},{"$f":"D909*Impostos!$C$19","v":0},0,0,null,null,""]
[null,null,null,null,{"$f":"D910*Impostos!$C$15","v":0},{"$f":"D910*Impostos!$C$16","v":0},{"$f":"D910*Impostos!$C$17","v":0},{"$f":"D910*Impostos!$C$18","v":0},{"$f":"D910*Impostos!$C$19","v":0},0,0,null,null,""]
[null,null,null,null,{"$f":"D911*Impostos!$C$15","v":0},{"$f":"D911*Impostos!$C$16","v":0},{"$f":"D911*Impostos!$C$17","v":0},{"$f":"D911*Impostos!$C$18","v":0},{"$f":"D911*Impostos!$C$19","v":0},0,0,null,null,""]
[null,null,null,null,{"$f":"D912*Impostos!$C$15","v":0},{"$f":"D912*Impostos!$C$16","v":0},{"$f":"D912*Impostos!$C$17","v":0},{"$f":"D912*Impostos!$C$18","v":0},{"$f":"D912*Impostos!$C$19","v":0},0,0,null,null,{"$f":"IF(C912=\"\",\"\",MONTH(C912))","v":""}]
[null,null,null,null,{"$f":"D913*Impostos!$C$15","v":0},{"$f":"D913*Impostos!$C$16","v":0},{"$f":"D913*Impostos!$C$17","v":0},{"$f":"D913*Impostos!$C$18","v":0},{"$f":"D913*Impostos!$C$19","v":0},0,0,null,null,""]
[null,null,null,null,{"$f":"D914*Impostos!$C$15","v":0},{"$f":"D914*Impostos!$C$16","v":0},{"$f":"D914*Impostos!$C$17","v":0},{"$f":"D914*Impostos!$C$18","v":0},{"$f":"D914*Impostos!$C$19","v":0},0,0,null,null,""]
[null,null,null,null,{"$f":"D915*Impostos!$C$15","v":0},{"$f":"D915*Impostos!$C$16","v":0},{"$f":"D915*Impostos!$C$17","v":0},{"$f":"D915*Impostos!$C$18","v":0},{"$f":"D915*Impostos!$C$19","v":0},0,0,null,null,""]
[null,null,null,null,{"$f":"D916*Impostos!$C$15","v":0},{"$f":"D916*Impostos!$C$16","v":0},{"$f":"D916*Impostos!$C$17","v":0},{"$f":"D916*Impostos!$C$18","v":0},{"$f":"D916*Impostos!$C$19","v":0},0,0,null,null,""]
[null,null,null,null,{"$f":"D917*Impostos!$C$15","v":0},{"$f":"D917*Impostos!$C$16","v":0},{"$f":"D917*Impostos!$C$17","v":0},{"$f":"D917*Impostos!$C$18","v":0},{"$f":"D917*Impostos!$C$19","v":0},0,0,null,null,""]
[null,null,null,null,{"$f":"D918*Impostos!$C$15","v":0},{"$f":"D918*Impostos!$C$16","v":0},{"$f":"D918*Impostos!$C$17","v":0},{"$f":"D918*Impostos!$C$18","v":0},{"$f":"D918*Impostos!$C$19","v":0},0,0,null,null,""]
[null,null,null,null,{"$f":"D919*Impostos!$C$15","v":0},{"$f":"D919*Impostos!$C$16","v":0},{"$f":"D919*Impostos!$C$17","v":0},{"$f":"D919*Impostos!$C$18","v":0},{"$f":"D919*Impostos!$C$19","v":0},0,0,null,null,""]
[null,null,null,null,{"$f":"D920*Impostos!$C$15","v":0},{"$f":"D920*Impostos!$C$16","v":0},{"$f":"D920*Impostos!$C$17","v":0},{"$f":"D920*Impostos!$C$18","v":0},{"$f":"D920*Impostos!$C$19","v":0},{"$f":"SUM(E920:I920)","v":0},{"$f":"D920-J920","v":0},null,null,""]
[null,null,null,null,{"$f":"D921*Impostos!$C$15","v":0},{"$f":"D921*Impostos!$C$16","v":0},{"$f":"D921*Impostos!$C$17","v":0},{"$f":"D921*Impostos!$C$18","v":0},{"$f":"D921*Impostos!$C$19","v":0},0,0,null,null,""]
[null,null,null,null,{"$f":"D922*Impostos!$C$15","v":0},{"$f":"D922*Impostos!$C$16","v":0},{"$f":"D922*Impostos!$C$17","v":0},{"$f":"D922*Impostos!$C$18","v":0},{"$f":"D922*Impostos!$C$19","v":0},0,0,null,null,""]
[null,null,null,null,{"$f":"D923*Impostos!$C$15","v":0},{"$f":"D923*Impostos!$C$16","v":0},{"$f":"D923*Impostos!$C$17","v":0},{"$f":"D923*Impostos!$C$18","v":0},{"$f":"D923*Impostos!$C$19","v":0},0,0,null,null,""]
[null,null,null,null,{"$f":"D924*Impostos!$C$15","v":0},{"$f":"D924*Impostos!$C$16","v":0},{"$f":"D924*Impostos!$C$17","v":0},{"$f":"D924*Impostos!$C$18","v":0},{"$f":"D924*Impostos!$C$19","v":0},0,0,null,null,""]
[null,null,null,null,{"$f":"D925*Impostos!$C$15","v":0},{"$f":"D925*Impostos!$C$16","v":0},{"$f":"D925*Impostos!$C$17","v":0},{"$f":"D925*Impostos!$C$18","v":0},{"$f":"D925*Impostos!$C$19","v":0},0,0,null,null,""]
[null,null,null,null,{"$f":"D926*Impostos!$C$15","v":0},{"$f":"D926*Impostos!$C$16","v":0},{"$f":"D926*Impostos!$C$17","v":0},{"$f":"D926*Impostos!$C$18","v":0},{"$f":"D926*Impostos!$C$19","v":0},0,0,null,null,""]
[null,null,null,null,{"$f":"D927*Impostos!$C$15","v":0},{"$f":"D927*Impostos!$C$16","v":0},{"$f":"D927*Impostos!$C$17","v":0},{"$f":"D927*Impostos!$C$18","v":0},{"$f":"D927*Impostos!$C$19","v":0},0,0,null,null,""]
[null,null,null,null,{"$f":"D928*Impostos!$C$15","v":0},{"$f":"D928*Impostos!$C$16","v":0},{"$f":"D928*Impostos!$C$17","v":0},{"$f":"D928*Impostos!$C$18","v":0},{"$f":"D928*Impostos!$C$19","v":0},0,0,null,null,""]
[null,null,null,null,{"$f":"D929*Impostos!$C$15","v":0},{"$f":"D929*Impostos!$C$16","v":0},{"$f":"D929*Impostos!$C$17","v":0},{"$f":"D929*Impostos!$C$18","v":0},{"$f":"D929*Impostos!$C$19","v":0},0,0,null,null,""]
[null,null,null,null,{"$f":"D930*Impostos!$C$15","v":0},{"$f":"D930*Impostos!$C$16","v":0},{"$f":"D930*Impostos!$C$17","v":0},{"$f":"D930*Impostos!$C$18","v":0},{"$f":"D930*Impostos!$C$19","v":0},0,0,null,null,""]
[null,null,null,null,{"$f":"D931*Impostos!$C$15","v":0},{"$f":"D931*Impostos!$C$16","v":0},{"$f":"D931*Impostos!$C$17","v":0},{"$f":"D931*Impostos!$C$18","v":0},{"$f":"D931*Impostos!$C$19","v":0},0,0,null,null,""]
[null,null,null,null,{"$f":"D932*Impostos!$C$15","v":0},{"$f":"D932*Impostos!$C$16","v":0},{"$f":"D932*Impostos!$C$17","v":0},{"$f":"D932*Impostos!$C$18","v":0},{"$f":"D932*Impostos!$C$19","v":0},0,0,null,null,""]
[null,null,null,null,{"$f":"D933*Impostos!$C$15","v":0},{"$f":"D933*Impostos!$C$16","v":0},{"$f":"D933*Impostos!$C$17","v":0},{"$f":"D933*Impostos!$C$18","v":0},{"$f":"D933*Impostos!$C$19","v":0},0,0,null,null,""]
[null,null,null,null,{"$f":"D934*Impostos!$C$15","v":0},{"$f":"D934*Impostos!$C$16","v":0},{"$f":"D934*Impostos!$C$17","v":0},{"$f":"D934*Impostos!$C$18","v":0},{"$f":"D934*Impostos!$C$19","v":0},0,0,null,null,""]
[null,null,null,null,{"$f":"D935*Impostos!$C$15","v":0},{"$f":"D935*Impostos!$C$16","v":0},{"$f":"D935*Impostos!$C$17","v":0},{"$f":"D935*Impostos!$C$18","v":0},{"$f":"D935*Impostos!$C$19","v":0},0,0,null,null,""]
[null,null,null,null,{"$f":"D936*Impostos!$C$15","v":0},{"$f":"D936*Impostos!$C$16","v":0},{"$f":"D936*Impostos!$C$17","v":0},{"$f":"D936*Impostos!$C$18","v":0},{"$f":"D936*Impostos!$C$19","v":0},0,0,null,null,""]
[null,null,null,null,{"$f":"D937*Impostos!$C$15","v":0},{"$f":"D937*Impostos!$C$16","v":0},{"$f":"D937*Impostos!$C$17","v":0},{"$f":"D937*Impostos!$C$18","v":0},{"$f":"D937*Impostos!$C$19","v":0},0,0,null,null,""]
[null,null,null,null,{"$f":"D938*Impostos!$C$15","v":0},{"$f":"D938*Impostos!$C$16","v":0},{"$f":"D938*Impostos!$C$17","v":0},{"$f":"D938*Impostos!$C$18","v":0},{"$f":"D938*Impostos!$C$19","v":0},0,0,null,null,""]
[null,null,null,null,{"$f":"D939*Impostos!$C$15","v":0},{"$f":"D939*Impostos!$C$16","v":0},{"$f":"D939*Impostos!$C$17","v":0},{"$f":"D939*Impostos!$C$18","v":0},{"$f":"D939*Impostos!$C$19","v":0},0,0,null,null,""]
[null,null,null,null,{"$f":"D940*Impostos!$C$15","v":0},{"$f":"D940*Impostos!$C$16","v":0},{"$f":"D940*Impostos!$C$17","v":0},{"$f":"D940*Impostos!$C$18","v":0},{"$f":"D940*Impostos!$C$19","v":0},0,0,null,null,""]
[null,null,null,null,{"$f":"D941*Impostos!$C$15","v":0},{"$f":"D941*Impostos!$C$16","v":0},{"$f":"D941*Impostos!$C$17","v":0},{"$f":"D941*Impostos!$C$18","v":0},{"$f":"D941*Impostos!$C$19","v":0},0,0,null,null,""]
[null,null,null,null,{"$f":"D942*Impostos!$C$15","v":0},{"$f":"D942*Impostos!$C$16","v":0},{"$f":"D942*Impostos!$C$17","v":0},{"$f":"D942*Impostos!$C$18","v":0},{"$f":"D942*Impostos!$C$19","v":0},0,0,null,null,""]
[null,null,null,null,{"$f":"D943*Impostos!$C$15","v":0},{"$f":"D943*Impostos!$C$16","v":0},{"$f":"D943*Impostos!$C$17","v":0},{"$f":"D943*Impostos!$C$18","v":0},{"$f":"D943*Impostos!$C$19","v":0},0,0,null,null,""]
[null,null,null,null,{"$f":"D944*Impostos!$C$15","v":0},{"$f":"D944*Impostos!$C$16","v":0},{"$f":"D944*Impostos!$C$17","v":0},{"$f":"D944*Impostos!$C$18","v":0},{"$f":"D944*Impostos!$C$19","v":0},0,0,null,null,""]
[null,null,null,null,{"$f":"D945*Impostos!$C$15","v":0},{"$f":"D945*Impostos!$C$16","v":0},{"$f":"D945*Impostos!$C$17","v":0},{"$f":"D945*Impostos!$C$18","v":0},{"$f":"D945*Impostos!$C$19","v":0},0,0,null,null,""]
[null,null,null,null,{"$f":"D946*Impostos!$C$15","v":0},{"$f":"D946*Impostos!$C$16","v":0},{"$f":"D946*Impostos!$C$17","v":0},{"$f":"D946*Impostos!$C$18","v":0},{"$f":"D946*Impostos!$C$19","v":0},0,0,null,null,""]
[null,null,null,null,{"$f":"D947*Impostos!$C$15","v":0},{"$f":"D947*Impostos!$C$16","v":0},{"$f":"D947*Impostos!$C$17","v":0},{"$f":"D947*Impostos!$C$18","v":0},{"$f":"D947*Impostos!$C$19","v":0},0,0,null,null,""]
[null,null,null,null,{"$f":"D948*Impostos!$C$15","v":0},{"$f":"D948*Impostos!$C$16","v":0},{"$f":"D948*Impostos!$C$17","v":0},{"$f":"D948*Impostos!$C$18","v":0},{"$f":"D948*Impostos!$C$19","v":0},0,0,null,null,""]
[null,null,null,null,{"$f":"D949*Impostos!$C$15","v":0},{"$f":"D949*Impostos!$C$16","v":0},{"$f":"D949*Impostos!$C$17","v":0},{"$f":"D949*Impostos!$C$18","v":0},{"$f":"D949*Impostos!$C$19","v":0},0,0,null,null,""]
[null,null,null,null,{"$f":"D950*Impostos!$C$15","v":0},{"$f":"D950*Impostos!$C$16","v":0},{"$f":"D950*Impostos!$C$17","v":0},{"$f":"D950*Impostos!$C$18","v":0},{"$f":"D950*Impostos!$C$19","v":0},0,0,null,null,""]
[null,null,null,null,{"$f":"D951*Impostos!$C$15","v":0},{"$f":"D951*Impostos!$C$16","v":0},{"$f":"D951*Impostos!$C$17","v":0},{"$f":"D951*Impostos!$C$18","v":0},{"$f":"D951*Impostos!$C$19","v":0},0,0,null,null,""]
[null,null,null,null,{"$f":"D952*Impostos!$C$15","v":0},{"$f":"D952*Impostos!$C$16","v":0},{"$f":"D952*Impostos!$C$17","v":0},{"$f":"D952*Impostos!$C$18","v":0},{"$f":"D952*Impostos!$C$19","v":0},0,0,null,null,""]
[null,null,null,null,{"$f":"D953*Impostos!$C$15","v":0},{"$f":"D953*Impostos!$C$16","v":0},{"$f":"D953*Impostos!$C$17","v":0},{"$f":"D953*Impostos!$C$18","v":0},{"$f":"D953*Impostos!$C$19","v":0},0,0,null,null,""]
[null,null,null,null,{"$f":"D954*Impostos!$C$15","v":0},{"$f":"D954*Impostos!$C$16","v":0},{"$f":"D954*Impostos!$C$17","v":0},{"$f":"D954*Impostos!$C$18","v":0},{"$f":"D954*Impostos!$C$19","v":0},0,0,null,null,""]
[null,null,null,null,{"$f":"D955*Impostos!$C$15","v":0},{"$f":"D955*Impostos!$C$16","v":0},{"$f":"D955*Impostos!$C$17","v":0},{"$f":"D955*Impostos!$C$18","v":0},{"$f":"D955*Impostos!$C$19","v":0},0,0,null,null,""]
[null,null,null,null,{"$f":"D956*Impostos!$C$15","v":0},{"$f":"D956*Impostos!$C$16","v":0},{"$f":"D956*Impostos!$C$17","v":0},{"$f":"D956*Impostos!$C$18","v":0},{"$f":"D956*Impostos!$C$19","v":0},0,0,null,null,""]
[null,null,null,null,{"$f":"D957*Impostos!$C$15","v":0},{"$f":"D957*Impostos!$C$16","v":0},{"$f":"D957*Impostos!$C$17","v":0},{"$f":"D957*Impostos!$C$18","v":0},{"$f":"D957*Impostos!$C$19","v":0},0,0,null,null,""]
[null,null,null,null,{"$f":"D958*Impostos!$C$15","v":0},{"$f":"D958*Impostos!$C$16","v":0},{"$f":"D958*Impostos!$C$17","v":0},{"$f":"D958*Impostos!$C$18","v":0},{"$f":"D958*Impostos!$C$19","v":0},0,0,null,null,""]
[null,null,null,null,{"$f":"D959*Impostos!$C$15","v":0},{"$f":"D959*Impostos!$C$16","v":0},{"$f":"D959*Impostos!$C$17","v":0},{"$f":"D959*Impostos!$C$18","v":0},{"$f":"D959*Impostos!$C$19","v":0},0,0,null,null,""]
[null,null,null,null,{"$f":"D960*Impostos!$C$15","v":0},{"$f":"D960*Impostos!$C$16","v":0},{"$f":"D960*Impostos!$C$17","v":0},{"$f":"D960*Impostos!$C$18","v":0},{"$f":"D960*Impostos!$C$19","v":0},0,0,null,null,""]
[null,null,null,null,{"$f":"D961*Impostos!$C$15","v":0},{"$f":"D961*Impostos!$C$16","v":0},{"$f":"D961*Impostos!$C$17","v":0},{"$f":"D961*Impostos!$C$18","v":0},{"$f":"D961*Impostos!$C$19","v":0},0,0,null,null,""]
[null,null,null,null,{"$f":"D962*Impostos!$C$15","v":0},{"$f":"D962*Impostos!$C$16","v":0},{"$f":"D962*Impostos!$C$17","v":0},{"$f":"D962*Impostos!$C$18","v":0},{"$f":"D962*Impostos!$C$19","v":0},0,0,null,null,""]
[null,null,null,null,{"$f":"D963*Impostos!$C$15","v":0},{"$f":"D963*Impostos!$C$16","v":0},{"$f":"D963*Impostos!$C$17","v":0},{"$f":"D963*Impostos!$C$18","v":0},{"$f":"D963*Impostos!$C$19","v":0},0,0,null,null,""]
[null,null,null,null,{"$f":"D964*Impostos!$C$15","v":0},{"$f":"D964*Impostos!$C$16","v":0},{"$f":"D964*Impostos!$C$17","v":0},{"$f":"D964*Impostos!$C$18","v":0},{"$f":"D964*Impostos!$C$19","v":0},0,0,null,null,""]
[null,null,null,null,{"$f":"D965*Impostos!$C$15","v":0},{"$f":"D965*Impostos!$C$16","v":0},{"$f":"D965*Impostos!$C$17","v":0},{"$f":"D965*Impostos!$C$18","v":0},{"$f":"D965*Impostos!$C$19","v":0},0,0,null,null,""]
[null,null,null,null,{"$f":"D966*Impostos!$C$15","v":0},{"$f":"D966*Impostos!$C$16","v":0},{"$f":"D966*Impostos!$C$17","v":0},{"$f":"D966*Impostos!$C$18","v":0},{"$f":"D966*Impostos!$C$19","v":0},0,0,null,null,""]
[null,null,null,null,{"$f":"D967*Impostos!$C$15","v":0},{"$f":"D967*Impostos!$C$16","v":0},{"$f":"D967*Impostos!$C$17","v":0},{"$f":"D967*Impostos!$C$18","v":0},{"$f":"D967*Impostos!$C$19","v":0},0,0,null,null,""]
[null,null,null,null,{"$f":"D968*Impostos!$C$15","v":0},{"$f":"D968*Impostos!$C$16","v":0},{"$f":"D968*Impostos!$C$17","v":0},{"$f":"D968*Impostos!$C$18","v":0},{"$f":"D968*Impostos!$C$19","v":0},0,0,null,null,""]
[null,null,null,null,{"$f":"D969*Impostos!$C$15","v":0},{"$f":"D969*Impostos!$C$16","v":0},{"$f":"D969*Impostos!$C$17","v":0},{"$f":"D969*Impostos!$C$18","v":0},{"$f":"D969*Impostos!$C$19","v":0},0,0,null,null,""]
[null,null,null,null,{"$f":"D970*Impostos!$C$15","v":0},{"$f":"D970*Impostos!$C$16","v":0},{"$f":"D970*Impostos!$C$17","v":0},{"$f":"D970*Impostos!$C$18","v":0},{"$f":"D970*Impostos!$C$19","v":0},0,0,null,null,""]
[null,null,null,null,{"$f":"D971*Impostos!$C$15","v":0},{"$f":"D971*Impostos!$C$16","v":0},{"$f":"D971*Impostos!$C$17","v":0},{"$f":"D971*Impostos!$C$18","v":0},{"$f":"D971*Impostos!$C$19","v":0},0,0,null,null,""]
[null,null,null,null,{"$f":"D972*Impostos!$C$15","v":0},{"$f":"D972*Impostos!$C$16","v":0},{"$f":"D972*Impostos!$C$17","v":0},{"$f":"D972*Impostos!$C$18","v":0},{"$f":"D972*Impostos!$C$19","v":0},0,0,null,null,""]
[null,null,null,null,{"$f":"D973*Impostos!$C$15","v":0},{"$f":"D973*Impostos!$C$16","v":0},{"$f":"D973*Impostos!$C$17","v":0},{"$f":"D973*Impostos!$C$18","v":0},{"$f":"D973*Impostos!$C$19","v":0},0,0,null,null,""]
[null,null,null,null,{"$f":"D974*Impostos!$C$15","v":0},{"$f":"D974*Impostos!$C$16","v":0},{"$f":"D974*Impostos!$C$17","v":0},{"$f":"D974*Impostos!$C$18","v":0},{"$f":"D974*Impostos!$C$19","v":0},0,0,null,null,""]
[null,null,null,null,{"$f":"D975*Impostos!$C$15","v":0},{"$f":"D975*Impostos!$C$16","v":0},{"$f":"D975*Impostos!$C$17","v":0},{"$f":"D975*Impostos!$C$18","v":0},{"$f":"D975*Impostos!$C$19","v":0},0,0,null,null,""]
[null,null,null,null,{"$f":"D976*Impostos!$C$15","v":0},{"$f":"D976*Impostos!$C$16","v":0},{"$f":"D976*Impostos!$C$17","v":0},{"$f":"D976*Impostos!$C$18","v":0},{"$f":"D976*Impostos!$C$19","v":0},0,0,null,null,{"$f":"IF(C976=\"\",\"\",MONTH(C976))","v":""}]
[null,null,null,null,{"$f":"D977*Impostos!$C$15","v":0},{"$f":"D977*Impostos!$C$16","v":0},{"$f":"D977*Impostos!$C$17","v":0},{"$f":"D977*Impostos!$C$18","v":0},{"$f":"D977*Impostos!$C$19","v":0},0,0,null,null,""]
[null,null,null,null,{"$f":"D978*Impostos!$C$15","v":0},{"$f":"D978*Impostos!$C$16","v":0},{"$f":"D978*Impostos!$C$17","v":0},{"$f":"D978*Impostos!$C$18","v":0},{"$f":"D978*Impostos!$C$19","v":0},0,0,null,null,""]
[null,null,null,null,{"$f":"D979*Impostos!$C$15","v":0},{"$f":"D979*Impostos!$C$16","v":0},{"$f":"D979*Impostos!$C$17","v":0},{"$f":"D979*Impostos!$C$18","v":0},{"$f":"D979*Impostos!$C$19","v":0},0,0,null,null,""]
[null,null,null,null,{"$f":"D980*Impostos!$C$15","v":0},{"$f":"D980*Impostos!$C$16","v":0},{"$f":"D980*Impostos!$C$17","v":0},{"$f":"D980*Impostos!$C$18","v":0},{"$f":"D980*Impostos!$C$19","v":0},0,0,null,null,""]
[null,null,null,null,{"$f":"D981*Impostos!$C$15","v":0},{"$f":"D981*Impostos!$C$16","v":0},{"$f":"D981*Impostos!$C$17","v":0},{"$f":"D981*Impostos!$C$18","v":0},{"$f":"D981*Impostos!$C$19","v":0},0,0,null,null,""]
[null,null,null,null,{"$f":"D982*Impostos!$C$15","v":0},{"$f":"D982*Impostos!$C$16","v":0},{"$f":"D982*Impostos!$C$17","v":0},{"$f":"D982*Impostos!$C$18","v":0},{"$f":"D982*Impostos!$C$19","v":0},0,0,null,null,""]
[null,null,null,null,{"$f":"D983*Impostos!$C$15","v":0},{"$f":"D983*Impostos!$C$16","v":0},{"$f":"D983*Impostos!$C$17","v":0},{"$f":"D983*Impostos!$C$18","v":0},{"$f":"D983*Impostos!$C$19","v":0},0,0,null,null,""]
[null,null,null,null,{"$f":"D984*Impostos!$C$15","v":0},{"$f":"D984*Impostos!$C$16","v":0},{"$f":"D984*Impostos!$C$17","v":0},{"$f":"D984*Impostos!$C$18","v":0},{"$f":"D984*Impostos!$C$19","v":0},{"$f":"SUM(E984:I984)","v":0},{"$f":"D984-J984","v":0},null,null,""]
[null,null,null,null,{"$f":"D985*Impostos!$C$15","v":0},{"$f":"D985*Impostos!$C$16","v":0},{"$f":"D985*Impostos!$C$17","v":0},{"$f":"D985*Impostos!$C$18","v":0},{"$f":"D985*Impostos!$C$19","v":0},0,0,null,null,""]
[null,null,null,null,{"$f":"D986*Impostos!$C$15","v":0},{"$f":"D986*Impostos!$C$16","v":0},{"$f":"D986*Impostos!$C$17","v":0},{"$f":"D986*Impostos!$C$18","v":0},{"$f":"D986*Impostos!$C$19","v":0},0,0,null,null,""]
[null,null,null,null,{"$f":"D987*Impostos!$C$15","v":0},{"$f":"D987*Impostos!$C$16","v":0},{"$f":"D987*Impostos!$C$17","v":0},{"$f":"D987*Impostos!$C$18","v":0},{"$f":"D987*Impostos!$C$19","v":0},0,0,null,null,""]
[null,null,null,null,{"$f":"D988*Impostos!$C$15","v":0},{"$f":"D988*Impostos!$C$16","v":0},{"$f":"D988*Impostos!$C$17","v":0},{"$f":"D988*Impostos!$C$18","v":0},{"$f":"D988*Impostos!$C$19","v":0},0,0,null,null,""]
[null,null,null,null,{"$f":"D989*Impostos!$C$15","v":0},{"$f":"D989*Impostos!$C$16","v":0},{"$f":"D989*Impostos!$C$17","v":0},{"$f":"D989*Impostos!$C$18","v":0},{"$f":"D989*Impostos!$C$19","v":0},0,0,null,null,""]
[null,null,null,null,{"$f":"D990*Impostos!$C$15","v":0},{"$f":"D990*Impostos!$C$16","v":0},{"$f":"D990*Impostos!$C$17","v":0},{"$f":"D990*Impostos!$C$18","v":0},{"$f":"D990*Impostos!$C$19","v":0},0,0,null,null,""]
[null,null,null,null,{"$f":"D991*Impostos!$C$15","v":0},{"$f":"D991*Impostos!$C$16","v":0},{"$f":"D991*Impostos!$C$17","v":0},{"$f":"D991*Impostos!$C$18","v":0},{"$f":"D991*Impostos!$C$19","v":0},0,0,null,null,""]
[null,null,null,null,{"$f":"D992*Impostos!$C$15","v":0},{"$f":"D992*Impostos!$C$16","v":0},{"$f":"D992*Impostos!$C$17","v":0},{"$f":"D992*Impostos!$C$18","v":0},{"$f":"D992*Impostos!$C$19","v":0},0,0,null,null,""]
[null,null,null,null,{"$f":"D993*Impostos!$C$15","v":0},{"$f":"D993*Impostos!$C$16","v":0},{"$f":"D993*Impostos!$C$17","v":0},{"$f":"D993*Impostos!$C$18","v":0},{"$f":"D993*Impostos!$C$19","v":0},0,0,null,null,""]
[null,null,null,null,{"$f":"D994*Impostos!$C$15","v":0},{"$f":"D994*Impostos!$C$16","v":0},{"$f":"D994*Impostos!$C$17","v":0},{"$f":"D994*Impostos!$C$18","v":0},{"$f":"D994*Impostos!$C$19","v":0},0,0,null,null,""]
[null,null,null,null,{"$f":"D995*Impostos!$C$15","v":0},{"$f":"D995*Impostos!$C$16","v":0},{"$f":"D995*Impostos!$C$17","v":0},{"$f":"D995*Impostos!$C$18","v":0},{"$f":"D995*Impostos!$C$19","v":0},0,0,null,null,""]
[null,null,null,null,{"$f":"D996*Impostos!$C$15","v":0},{"$f":"D996*Impostos!$C$16","v":0},{"$f":"D996*Impostos!$C$17","v":0},{"$f":"D996*Impostos!$C$18","v":0},{"$f":"D996*Impostos!$C$19","v":0},0,0,null,null,""]
[null,null,null,null,{"$f":"D997*Impostos!$C$15","v":0},{"$f":"D997*Impostos!$C$16","v":0},{"$f":"D997*Impostos!$C$17","v":0},{"$f":"D997*Impostos!$C$18","v":0},{"$f":"D997*Impostos!$C$19","v":0},0,0,null,null,""]
[null,null,null,null,{"$f":"D998*Impostos!$C$15","v":0},{"$f":"D998*Impostos!$C$16","v":0},{"$f":"D998*Impostos!$C$17","v":0},{"$f":"D998*Impostos!$C$18","v":0},{"$f":"D998*Impostos!$C$19","v":0},0,0,null,null,""]
[null,null,null,null,{"$f":"D999*Impostos!$C$15","v":0},{"$f":"D999*Impostos!$C$16","v":0},{"$f":"D999*Impostos!$C$17","v":0},{"$f":"D999*Impostos!$C$18","v":0},{"$f":"D999*Impostos!$C$19","v":0},0,0,null,null,""]
[null,null,null,null,{"$f":"D1000*Impostos!$C$15","v":0},{"$f":"D1000*Impostos!$C$16","v":0},{"$f":"D1000*Impostos!$C$17","v":0},{"$f":"D1000*Impostos!$C$18","v":0},{"$f":"D1000*Impostos!$C$19","v":0},0,0,null,null,""]

{"sheet":"Dash","index":4,"n_rows":41,"n_cols":4,"rows_kept":41,"cut":false,"hidden":false,"merged":[[40,2,42,5],[10,1,10,2],[10,3,10,20],[29,3,29,5],[32,2,34,5],[36,2,38,5]]}
[]
[]
[]
[]
[]
[]
[]
[]
[]
[]
[null,"Empresa:",null,{"$f":"Socios!C10","v":"Empresa ABCDE"}]
[]
[]
[]
[]
[]
[]
[]
[]
[]
[]
[]
[]
[]
[]
[]
[]
[]
[]
["Selecione um Sócio:",null,null,"Pedro Alves"]
[]
[]
["Total Previsto:",null,{"$f":"calc!N18","v":48000}]
[]
[]
[]
["Total Realizado:",null,{"$f":"calc!N19","v":1860}]
[]
[]
[]
[null,"%:",{"$f":"calc!N20","v":3.875E-2}]

{"sheet":"Instruções","index":5,"n_rows":0,"n_cols":0,"rows_kept":0,"cut":false,"hidden":false,"merged":[]}

{"sheet":"calc","index":6,"n_rows":20,"n_cols":14,"rows_kept":20,"cut":false,"hidden":false,"merged":[]}
["REALIZADO",1,2,3,4,5,6,7,8,9,10,11,12]
[null,"Janeiro","Fevereiro","Março","Abril","Maio","Junho","Julho","Agosto","Setembro","Outubro","Novembro","Dezembro","Total"]
[{"$f":"IF(Socios!B15=\"\",\"\",Socios!B15)","v":"João Paulo"},{"$f":"SUMIFS(Historico!$K$15:$K$1000,Historico!$B$15:$B$1000,calc!$A3,Historico!$N$15:$N$1000,calc!B$1)","v":0},{"$f":"SUMIFS(Historico!$K$15:$K$1000,Historico!$B$15:$B$1000,calc!$A3,Historico!$N$15:$N$1000,calc!C$1)","v":0},{"$f":"SUMIFS(Historico!$K$15:$K$1000,Historico!$B$15:$B$1000,calc!$A3,Historico!$N$15:$N$1000,calc!D$1)","v":0},{"$f":"SUMIFS(Historico!$K$15:$K$1000,Historico!$B$15:$B$1000,calc!$A3,Historico!$N$15:$N$1000,calc!E$1)","v":0},{"$f":"SUMIFS(Historico!$K$15:$K$1000,Historico!$B$15:$B$1000,calc!$A3,Historico!$N$15:$N$1000,calc!F$1)","v":2790},{"$f":"SUMIFS(Historico!$K$15:$K$1000,Historico!$B$15:$B$1000,calc!$A3,Historico!$N$15:$N$1000,calc!G$1)","v":0},{"$f":"SUMIFS(Historico!$K$15:$K$1000,Historico!$B$15:$B$1000,calc!$A3,Historico!$N$15:$N$1000,calc!H$1)","v":1395},{"$f":"SUMIFS(Historico!$K$15:$K$1000,Historico!$B$15:$B$1000,calc!$A3,Historico!$N$15:$N$1000,calc!I$1)","v":1860},{"$f":"SUMIFS(Historico!$K$15:$K$1000,Historico!$B$15:$B$1000,calc!$A3,Historico!$N$15:$N$1000,calc!J$1)","v":0},{"$f":"SUMIFS(Historico!$K$15:$K$1000,Historico!$B$15:$B$1000,calc!$A3,Historico!$N$15:$N$1000,calc!K$1)","v":0},{"$f":"SUMIFS(Historico!$K$15:$K$1000,Historico!$B$15:$B$1000,calc!$A3,Historico!$N$15:$N$1000,calc!L$1)","v":0},{"$f":"SUMIFS(Historico!$K$15:$K$1000,Historico!$B$15:$B$1000,calc!$A3,Historico!$N$15:$N$1000,calc!M$1)","v":0},{"$f":"SUM(B3:M3)","v":6045}]
[{"$f":"IF(Socios!B16=\"\",\"\",Socios!B16)","v":"Pedro Alves"},{"$f":"SUMIFS(Historico!$K$15:$K$1000,Historico!$B$15:$B$1000,calc!$A4,Historico!$N$15:$N$1000,calc!B$1)","v":0},{"$f":"SUMIFS(Historico!$K$15:$K$1000,Historico!$B$15:$B$1000,calc!$A4,Historico!$N$15:$N$1000,calc!C$1)","v":0},{"$f":"SUMIFS(Historico!$K$15:$K$1000,Historico!$B$15:$B$1000,calc!$A4,Historico!$N$15:$N$1000,calc!D$1)","v":0},{"$f":"SUMIFS(Historico!$K$15:$K$1000,Historico!$B$15:$B$1000,calc!$A4,Historico!$N$15:$N$1000,calc!E$1)","v":0},{"$f":"SUMIFS(Historico!$K$15:$K$1000,Historico!$B$15:$B$1000,calc!$A4,Historico!$N$15:$N$1000,calc!F$1)","v":0},{"$f":"SUMIFS(Historico!$K$15:$K$1000,Historico!$B$15:$B$1000,calc!$A4,Historico!$N$15:$N$1000,calc!G$1)","v":1860},{"$f":"SUMIFS(Historico!$K$15:$K$1000,Historico!$B$15:$B$1000,calc!$A4,Historico!$N$15:$N$1000,calc!H$1)","v":0},{"$f":"SUMIFS(Historico!$K$15:$K$1000,Historico!$B$15:$B$1000,calc!$A4,Historico!$N$15:$N$1000,calc!I$1)","v":0},{"$f":"SUMIFS(Historico!$K$15:$K$1000,Historico!$B$15:$B$1000,calc!$A4,Historico!$N$15:$N$1000,calc!J$1)","v":0},{"$f":"SUMIFS(Historico!$K$15:$K$1000,Historico!$B$15:$B$1000,calc!$A4,Historico!$N$15:$N$1000,calc!K$1)","v":0},{"$f":"SUMIFS(Historico!$K$15:$K$1000,Historico!$B$15:$B$1000,calc!$A4,Historico!$N$15:$N$1000,calc!L$1)","v":0},{"$f":"SUMIFS(Historico!$K$15:$K$1000,Historico!$B$15:$B$1000,calc!$A4,Historico!$N$15:$N$1000,calc!M$1)","v":0},{"$f":"SUM(B4:M4)","v":1860}]
[{"$f":"IF(Socios!B17=\"\",\"\",Socios!B17)","v":"Sócio 3"},{"$f":"SUMIFS(Historico!$K$15:$K$1000,Historico!$B$15:$B$1000,calc!$A5,Historico!$N$15:$N$1000,calc!B$1)","v":0},{"$f":"SUMIFS(Historico!$K$15:$K$1000,Historico!$B$15:$B$1000,calc!$A5,Historico!$N$15:$N$1000,calc!C$1)","v":0},{"$f":"SUMIFS(Historico!$K$15:$K$1000,Historico!$B$15:$B$1000,calc!$A5,Historico!$N$15:$N$1000,calc!D$1)","v":0},{"$f":"SUMIFS(Historico!$K$15:$K$1000,Historico!$B$15:$B$1000,calc!$A5,Historico!$N$15:$N$1000,calc!E$1)","v":0},{"$f":"SUMIFS(Historico!$K$15:$K$1000,Historico!$B$15:$B$1000,calc!$A5,Historico!$N$15:$N$1000,calc!F$1)","v":0},{"$f":"SUMIFS(Historico!$K$15:$K$1000,Historico!$B$15:$B$1000,calc!$A5,Historico!$N$15:$N$1000,calc!G$1)","v":0},{"$f":"SUMIFS(Historico!$K$15:$K$1000,Historico!$B$15:$B$1000,calc!$A5,Historico!$N$15:$N$1000,calc!H$1)","v":0},{"$f":"SUMIFS(Historico!$K$15:$K$1000,Historico!$B$15:$B$1000,calc!$A5,Historico!$N$15:$N$1000,calc!I$1)","v":0},{"$f":"SUMIFS(Historico!$K$15:$K$1000,Historico!$B$15:$B$1000,calc!$A5,Historico!$N$15:$N$1000,calc!J$1)","v":0},{"$f":"SUMIFS(Historico!$K$15:$K$1000,Historico!$B$15:$B$1000,calc!$A5,Historico!$N$15:$N$1000,calc!K$1)","v":930},{"$f":"SUMIFS(Historico!$K$15:$K$1000,Historico!$B$15:$B$1000,calc!$A5,Historico!$N$15:$N$1000,calc!L$1)","v":0},{"$f":"SUMIFS(Historico!$K$15:$K$1000,Historico!$B$15:$B$1000,calc!$A5,Historico!$N$15:$N$1000,calc!M$1)","v":0},930]
[{"$f":"IF(Socios!B18=\"\",\"\",Socios!B18)","v":"Sócio 4"},{"$f":"SUMIFS(Historico!$K$15:$K$1000,Historico!$B$15:$B$1000,calc!$A6,Historico!$N$15:$N$1000,calc!B$1)","v":0},{"$f":"SUMIFS(Historico!$K$15:$K$1000,Historico!$B$15:$B$1000,calc!$A6,Historico!$N$15:$N$1000,calc!C$1)","v":0},{"$f":"SUMIFS(Historico!$K$15:$K$1000,Historico!$B$15:$B$1000,calc!$A6,Historico!$N$15:$N$1000,calc!D$1)","v":0},{"$f":"SUMIFS(Historico!$K$15:$K$1000,Historico!$B$15:$B$1000,calc!$A6,Historico!$N$15:$N$1000,calc!E$1)","v":0},{"$f":"SUMIFS(Historico!$K$15:$K$1000,Historico!$B$15:$B$1000,calc!$A6,Historico!$N$15:$N$1000,calc!F$1)","v":0},{"$f":"SUMIFS(Historico!$K$15:$K$1000,Historico!$B$15:$B$1000,calc!$A6,Historico!$N$15:$N$1000,calc!G$1)","v":0},{"$f":"SUMIFS(Historico!$K$15:$K$1000,Historico!$B$15:$B$1000,calc!$A6,Historico!$N$15:$N$1000,calc!H$1)","v":0},{"$f":"SUMIFS(Historico!$K$15:$K$1000,Historico!$B$15:$B$1000,calc!$A6,Historico!$N$15:$N$1000,calc!I$1)","v":0},{"$f":"SUMIFS(Historico!$K$15:$K$1000,Historico!$B$15:$B$1000,calc!$A6,Historico!$N$15:$N$1000,calc!J$1)","v":0},{"$f":"SUMIFS(Historico!$K$15:$K$1000,Historico!$B$15:$B$1000,calc!$A6,Historico!$N$15:$N$1000,calc!K$1)","v":930},{"$f":"SUMIFS(Historico!$K$15:$K$1000,Historico!$B$15:$B$1000,calc!$A6,Historico!$N$15:$N$1000,calc!L$1)","v":0},{"$f":"SUMIFS(Historico!$K$15:$K$1000,Historico!$B$15:$B$1000,calc!$A6,Historico!$N$15:$N$1000,calc!M$1)","v":0},930]
[{"$f":"IF(Socios!B19=\"\",\"\",Socios!B19)","v":"Sócio 5"},{"$f":"SUMIFS(Historico!$K$15:$K$1000,Historico!$B$15:$B$1000,calc!$A7,Historico!$N$15:$N$1000,calc!B$1)","v":0},{"$f":"SUMIFS(Historico!$K$15:$K$1000,Historico!$B$15:$B$1000,calc!$A7,Historico!$N$15:$N$1000,calc!C$1)","v":0},{"$f":"SUMIFS(Historico!$K$15:$K$1000,Historico!$B$15:$B$1000,calc!$A7,Historico!$N$15:$N$1000,calc!D$1)","v":0},{"$f":"SUMIFS(Historico!$K$15:$K$1000,Historico!$B$15:$B$1000,calc!$A7,Historico!$N$15:$N$1000,calc!E$1)","v":0},{"$f":"SUMIFS(Historico!$K$15:$K$1000,Historico!$B$15:$B$1000,calc!$A7,Historico!$N$15:$N$1000,calc!F$1)","v":0},{"$f":"SUMIFS(Historico!$K$15:$K$1000,Historico!$B$15:$B$1000,calc!$A7,Historico!$N$15:$N$1000,calc!G$1)","v":0},{"$f":"SUMIFS(Historico!$K$15:$K$1000,Historico!$B$15:$B$1000,calc!$A7,Historico!$N$15:$N$1000,calc!H$1)","v":0},{"$f":"SUMIFS(Historico!$K$15:$K$1000,Historico!$B$15:$B$1000,calc!$A7,Historico!$N$15:$N$1000,calc!I$1)","v":0},{"$f":"SUMIFS(Historico!$K$15:$K$1000,Historico!$B$15:$B$1000,calc!$A7,Historico!$N$15:$N$1000,calc!J$1)","v":0},{"$f":"SUMIFS(Historico!$K$15:$K$1000,Historico!$B$15:$B$1000,calc!$A7,Historico!$N$15:$N$1000,calc!K$1)","v":930},{"$f":"SUMIFS(Historico!$K$15:$K$1000,Historico!$B$15:$B$1000,calc!$A7,Historico!$N$15:$N$1000,calc!L$1)","v":0},{"$f":"SUMIFS(Historico!$K$15:$K$1000,Historico!$B$15:$B$1000,calc!$A7,Historico!$N$15:$N$1000,calc!M$1)","v":0},930]
[]
["PREVISTO","Janeiro","Fevereiro","Março","Abril","Maio","Junho","Julho","Agosto","Setembro","Outubro","Novembro","Dezembro","Total"]
[{"$f":"A3","v":"João Paulo"},{"$f":"Socios!D15","v":4000},{"$f":"B10","v":4000},{"$f":"C10","v":4000},4000,4000,4000,4000,4000,4000,4000,4000,4000,{"$f":"SUM(B10:M10)","v":48000}]
[{"$f":"A4","v":"Pedro Alves"},{"$f":"Socios!D16","v":4000},{"$f":"B11","v":4000},4000,4000,4000,4000,4000,4000,4000,4000,4000,4000,{"$f":"SUM(B11:M11)","v":48000}]
["Sócio 3",{"$f":"Socios!D17","v":4000},4000,4000,4000,4000,4000,4000,4000,4000,4000,4000,4000,48000]
["Sócio 4",{"$f":"Socios!D18","v":4000},4000,4000,4000,4000,4000,4000,4000,4000,4000,4000,4000,48000]
["Sócio 5",{"$f":"Socios!D19","v":4000},4000,4000,4000,4000,4000,4000,4000,4000,4000,4000,4000,48000]
[]
["Selecionado",2,3,4,5,6,7,8,9,10,11,12,13,14]
[{"$f":"Dash!D30","v":"Pedro Alves"},"Janeiro","Fevereiro","Março","Abril","Maio","Junho","Julho","Agosto","Setembro","Outubro","Novembro","Dezembro","Total"]
["PREVISTO",{"$f":"IFERROR(VLOOKUP($A$17,$A$10:$N$14,B16,0),\"\")","v":4000},{"$f":"IFERROR(VLOOKUP($A$17,$A$10:$N$14,C16,0),\"\")","v":4000},4000,4000,4000,4000,4000,4000,4000,4000,4000,4000,48000]
["REALIZADO",{"$f":"IFERROR(VLOOKUP($A$17,$A$3:$N$7,B16,0),\"\")","v":0},{"$f":"IFERROR(VLOOKUP($A$17,$A$3:$N$7,C16,0),\"\")","v":0},0,0,0,1860,0,0,0,0,0,0,1860]
["%",{"$f":"IFERROR(B19/B18,\"\")","v":0},{"$f":"IFERROR(C19/C18,\"\")","v":0},0,0,0,0.46500000000000002,0,0,0,0,0,0,3.875E-2]